{"text_format":"1","workbook":"xlsx","n_sheets":11,"sheets":["Introduction","1. Agency Overview","2a. Guiding Principles","2b. Guiding Principles Surveyed","3. Linkages","4a. SWOT (summarized)","5. Strategy","6. Resulting Modernization Plan","Timeline","Cost","Validation"],"not_rendered":{"charts":11,"images":3,"macros":1,"external_links":0,"defined_names":19,"comments":2,"pivot_tables":0},"unopened":[],"bounds":{"document_bytes":16777216,"sheet_cells":100000,"rows_first":2000,"rows_last":500,"rows_between":2000,"halvings":0,"cell_chars":16384,"cell_head_chars":4096},"cells_cut":0,"cells_raw":0,"read":"whole","date_system":"1900"}

{"sheet":"Introduction","index":0,"n_rows":33,"n_cols":4,"rows_kept":33,"cut":false,"hidden":false,"merged":[[8,1,8,13],[4,1,4,13],[11,1,11,13],[1,3,1,13],[2,3,2,13],[32,1,32,13],[14,1,14,13],[31,1,31,13],[20,1,20,13],[23,1,23,13],[26,1,26,13],[29,1,29,13],[17,1,17,13],[19,1,19,13],[22,1,22,13],[25,1,25,13],[28,1,28,13]]}
[]
[null,null,null,"IT Modernization Planning Workbook"]
[null,null,null,"for Small-Scale Organizations"]
[]
[null,"Please ensure you engage your Assistant State Chief Information Officer while using this template!"]
[]
[]
[null,"Purpose:"]
{"$rows_left_out":26}
{"sheet":"1. Agency Overview","index":1,"n_rows":43,"n_cols":4,"rows_kept":43,"cut":false,"hidden":false,"merged":[[9,1,9,11],[13,1,13,11],[17,1,17,11],[27,1,27,11],[4,1,4,11],[8,1,8,11],[5,1,5,11],[6,1,6,11],[10,1,10,11],[14,1,14,11],[30,1,30,11],[12,1,12,11],[16,1,16,11],[18,1,18,11],[19,1,19,11],[20,1,20,11],[21,1,21,11],[22,1,22,11],[23,1,23,11],[26,1,26,11],[28,1,28,11],[29,1,29,11],[31,1,31,11],[32,1,32,11],[33,1,33,11],[34,1,34,11],[37,1,37,11],[36,1,36,11],[45,3,45,11],[46,3,46,11],[47,3,47,11],[48,3,48,11],[39,3,39,11],[40,3,40,11],[41,3,41,11],[42,3,42,11],[43,3,43,11],[44,3,44,11]]}
[]
[null,"STEP 1:  Setting the Strategic Foundation"]
[null,"Fill in each field with the associated organization related information"]
[]
[null,"Organization Name"]
[null,"Insert the organization’s name"]
[null,"State of Oregon Commission for the Blind"]
[]
{"$rows_left_out":36}
{"sheet":"2a. Guiding Principles","index":2,"n_rows":27,"n_cols":7,"rows_kept":27,"cut":false,"hidden":false,"merged":[[4,1,4,5],[25,1,26,1],[13,1,14,1],[16,1,17,1],[19,1,20,1],[22,1,23,1]]}
[]
[null,"STEP 2:  Determining Guiding Principles"]
[]
[null,"Setting the Vision for use of Technologies"]
[null,"The principles below should guide every IT decision and set the boundaries of what is acceptable. Business leaders should lead the process of deciding what the key drivers are for automation (a.k.a. IT governance process), as well as the importance of how it is operated and supported.\n\nWhere practical, making IT decisions should be a partnership, leveraging both enterprise and localized resources to meet the strategic goals of the organization, and requiring discussions that ensure the optimal use of limited IT resources. In collaborative organizations decision-makers are often asked to balance seemingly conflicting requirements; e.g., innovation vs. stability, standardization vs. autonomy, openness vs. security, consensus vs. efficiency in decision making, centralized vs. distributed services, and closed proprietary systems vs. public open source possibilities. By embracing guiding principles at the onset of the IT governance process the endeavor to balance the needs becomes clearer, and will lead to organizational goals being met."]
[]
[null,"Guiding Principles"]
[null,"Check the boxes for each guiding principle driving IT need - Pick the key values that resonate within the organization (Generally 3 to 5 is sufficient)"]
{"$rows_left_out":20}
{"sheet":"2b. Guiding Principles Surveyed","index":3,"n_rows":44,"n_cols":12,"rows_kept":44,"cut":false,"hidden":true,"merged":[[0,2,0,11],[29,2,29,3],[29,4,29,5],[29,6,29,7],[29,8,29,9],[29,10,29,11],[1,2,1,3],[1,4,1,5],[1,6,1,7],[1,8,1,9],[1,10,1,11]]}
["Please tell us (if you want to) whether you’re: staff,  management, other","Responses from\n\n23 Staff\n3 Management","Here are five guiding principles we are using in the IT Strategic Plan. Please rank them 1 through 5 with 1 being most preferred and 5 being least preferred. This question will help us understand how you (and others) feel about and value particular outcomes."]
["Response","Role?","User Focused - Ease of Use - Technology solutions will be designed to optimize the user’s experience while maximizing sharing and reuse of technologies.",null,"Quality Business Data - Ensure sound data stewardship by providing a secure and accessible data environment.",null,"Cross-organization Collaboration - We will work within and across organizational structures to meet strategic goals and identify opportunities for innovation and improvement.",null,"Cloud-Smart Approach - Using Cloud services allows the organizations to take a strategic look at what infrastructure will best serve each business workload, and can better align to meet specific business goals and values.",null,"Mission First - IT exists to support and enable the mission of the organization, and business strategy will drive IT strategies and initiatives."]
["Staff",null,1,null,5,null,4,null,3,null,2]
["Staff",null,1,null,5,null,4,null,3,null,2]
["Staff",null,1,null,3,null,4,null,5,null,2]
["Staff",null,1,null,3,null,4,null,5,null,2]
["Staff",null,1,null,3,null,4,null,5,null,2]
["Staff",null,1,null,5,null,4,null,2,null,3]
{"$rows_left_out":37}
{"sheet":"3. Linkages","index":4,"n_rows":27,"n_cols":5,"rows_kept":27,"cut":false,"hidden":false,"merged":[[20,2,20,13],[4,2,4,13],[7,2,7,13],[9,4,9,13],[10,4,10,13],[11,4,11,13],[12,4,12,13],[13,4,13,13],[14,4,14,13],[15,4,15,13],[16,2,16,13],[19,2,19,13],[26,2,26,13],[21,2,21,13],[22,2,22,13],[23,2,23,13],[24,2,24,13],[25,2,25,13]]}
[]
[null,null,"STEP 3:  Linking Business Goals to Initiatives"]
[]
[null,null,"Purpose of a Strategic Plan"]
[null,null,"A plan helps guide an organization as it formulates its overall strategy. While an information technology (IT) strategy focuses on how automation will help the business succeed, an IT strategic plan is a roadmap to help the business implement those strategies. The plan outlines areas where automation can contribute business value and where an organization can gain advantage by making the best use of technology resources. An IT strategic plan documents the relationship of business goals and the use of technology to enabled effective and efficient business processes. It serves as a guide to IT-related decision making, with IT tasks prioritized and implemented using the plan as a framework."]
[]
[null,null,"Where to Start"]
[null,null,"Using basic Lean practices it is easy to spot areas where improvement can be made, and where investment in automation can make a difference. There are generally eight categories of inefficiencies, or what is referred to as \"Waste\". The outline below is an example framework of waste as where automation can be used for improvements:"]
{"$rows_left_out":20}
{"sheet":"4a. SWOT (summarized)","index":5,"n_rows":45,"n_cols":5,"rows_kept":45,"cut":false,"hidden":false,"merged":[[3,1,3,4],[4,1,4,4],[35,1,35,4],[11,1,11,4]]}
[]
[null,"STEP 4:  SWOT Analysis (Optional)"]
[]
[null,"Strength, Weakness, Opportunities, Threats Tool"]
[null,"SWOT analysis is a strategic planning technique to identifying core strengths, weaknesses, opportunities, and threats that leads to fact-based analysis, fresh perspectives, and new ideas.\n\nA SWOT analysis pulls information from internal sources (strengths of weaknesses of the agency) as well as external forces that may have uncontrollable impacts to decisions (opportunities and threats). SWOT analysis works best when diverse groups or voices within an agency are free to provide realistic data points rather than prescribed messaging. Findings of a SWOT analysis are often synthesized to support a focused set of objective or decision that an agency is facing."]
[]
[null,"Strength Questions Year 2023","Strength Questions Year 2025","Weakness Questions 2023","Weakness Questions Year 2025"]
[null,"1. What tech resource is most useful?\n2. What tech resource makes your day easier?\n3. What tech resource can you not work without?","1. What tool on your computer is most useful (specific software or system)?\n2. What tech resource saves you time?","1. Where tech experience is the most frustrating for you?\n2. What tech area needs attention from our IT folks?\n3. Considering what OCB has, what IT service, tech tool or platform do you wish the agency or state would dedicate more resources (time, money, or personnel) to?","1. What part of your workflow done on your computer or phone is most frustrating for you?\n2. What tech area could be improved with support from IT?"]
{"$rows_left_out":38}
{"sheet":"5. Strategy","index":6,"n_rows":35,"n_cols":28,"rows_kept":35,"cut":false,"hidden":false,"merged":[[24,1,25,1],[27,1,28,1],[30,1,31,1],[31,2,31,7],[31,9,31,12],[25,9,25,12],[28,9,28,12],[25,2,25,7],[28,2,28,7],[24,2,24,7],[24,9,24,12],[27,2,27,7],[27,9,27,12],[30,2,30,7],[30,9,30,12],[18,2,18,7],[21,9,21,12],[21,1,22,1],[9,2,9,7],[9,9,9,12],[22,2,22,7],[22,9,22,12],[19,9,19,12],[21,2,21,5],[21,6,21,7],[4,2,4,13],[7,2,7,4],[18,1,19,1],[10,9,10,12],[10,2,10,7],[13,2,13,7],[16,2,16,7],[19,2,19,7],[12,2,12,7],[12,9,12,12],[12,1,13,1],[15,2,15,7],[15,9,15,12],[15,1,16,1],[18,9,18,12],[16,9,16,12],[9,17,9,18],[7,8,7,11],[9,20,9,23],[9,14,9,15],[13,9,13,12],[33,1,34,1],[33,2,33,7],[33,9,33,12],[34,2,34,7],[34,9,34,12]]}
[]
[null,null,"STEP 5:  Linking Business Goals to Initiatives"]
[]
[null,null,"Planning is a Step-wise Process"]
[null,null,"Tying business goals to actions is a series of connected planning activities simplified in the steps below. Start with selecting the key business goals to be addressed, and follow the sequenced steps 1 through 7 (left to right) to outline a framework for an IT Strategic Plan. The result demonstrates a clear linkage between organization goals, the improvement opportunity, and how it will affect the business key performance measures. Each item is automatically rolled up into a one-page plan overview on the \"4. Resulting Modernization Plan\" tab."]
[]
[null,null,"Building the Information Technology Modernization Action Plan"]
[null,null,"Select Start Year for Plan:",null,null,2023,null,null,"Select Finish Year for Plan:",null,null,null,2027,null,null,null,null,null,null,null,null,null,null,null,null,"Updated Plan Version 2025 - DUE JUNE 1, 2025"]
{"$rows_left_out":28}
{"sheet":"6. Resulting Modernization Plan","index":7,"n_rows":65,"n_cols":89,"rows_kept":65,"cut":false,"hidden":false,"merged":[[11,30,12,55],[19,59,20,84],[44,2,47,26],[48,2,51,26],[0,23,3,99],[9,1,10,27],[11,2,12,26],[21,2,26,26],[19,2,20,26],[13,2,18,26],[11,88,12,113],[11,59,12,84],[9,29,10,56],[9,58,10,85],[9,87,10,114],[15,88,16,113],[32,30,35,55],[36,30,39,55],[19,88,20,113],[15,59,16,84],[38,88,39,113],[34,59,35,84],[36,59,37,84],[38,59,39,84],[32,59,33,84],[31,59,31,84],[32,88,33,113],[36,88,37,113],[13,86,15,86],[31,88,31,113],[34,88,35,113],[13,30,16,55],[27,2,28,26],[29,2,31,26],[32,2,35,26],[36,2,39,26],[40,2,43,26],[47,59,48,84],[40,29,41,56],[53,30,53,55],[57,88,58,113],[42,87,43,114],[45,58,46,85],[44,88,45,113],[42,30,43,55],[40,59,41,84],[17,30,20,55],[21,30,24,55],[25,30,28,55],[29,30,31,55],[13,59,14,84],[17,59,18,84],[21,59,22,84],[25,59,26,84],[29,59,30,84],[27,59,28,84],[23,59,24,84],[13,88,14,113],[17,88,18,113],[21,88,22,113],[25,88,26,113],[29,88,30,113],[23,88,24,113],[27,88,28,113],[64,30,67,55],[48,30,48,55],[44,30,47,55],[49,30,52,55],[58,30,58,55],[54,30,57,55],[63,30,63,55],[59,30,62,55]]}
[]
[]
[]
[]
[]
[]
[]
[]
{"$rows_left_out":58}
{"sheet":"Timeline","index":8,"n_rows":21,"n_cols":9,"rows_kept":21,"cut":false,"hidden":false,"merged":[[5,6,5,8],[16,1,16,8]]}
[]
[null,"AUTOMATIC:  Timeline for Initiatives"]
[]
[null,"Chart Start Date",{"$f":"DATE(Period,1,1)","v":"2023-01-01"},{"$f":"PT_ScaleChartAxis(\"Timeline\",\"Chart 31\",\"Y\",\"Primary\",C4,C5,C6,0)","v":{"$error":"#NAME?"}}]
[null,"Chart End Date",{"$f":"DATE(FINISH,12,31)","v":"2027-12-31"}]
[null,"Time Units",366,null,null,null,"Calculated"]
[null,"Project Name","Planned Start","Actual Start","Planned Finished","Forecasted Finish","Start Variance","Slip","Finish Variance"]
[null,{"$f":"IF('5. Strategy'!O14=0,\"\",'5. Strategy'!O14)","v":"Local To Cloud File Shares"},{"$f":"IF('5. Strategy'!V14=0,\"\",'5. Strategy'!V14)","v":"2024-07-01"},{"$f":"Table113[[#This Row],[Planned Start]]","v":"2024-07-01"},{"$f":"IF('5. Strategy'!V14=0,\"\",'5. Strategy'!V14+('5. Strategy'!X14*30))","v":"2025-06-26"},{"$f":"Table113[[#This Row],[Planned Finished]]","v":"2025-06-26"},{"$f":"IFERROR(D8-C8,\"\")","v":0},{"$f":"IFERROR(IF(F8>E8,E8-D8,((E8-D8)+(F8-E8))),\"\")","v":360},{"$f":"IFERROR(IF(D8>E8,E8-D8,0)+F8-E8,\"\")","v":0}]
{"$rows_left_out":14}
{"sheet":"Cost","index":9,"n_rows":15,"n_cols":12,"rows_kept":15,"cut":false,"hidden":false,"merged":[]}
[]
[null,"AUTOMATIC:  Investment Calculations"]
[]
[null,"Investment by Goal",null,null,"Year over Year",null,null,"Temporary Data",null,null,"Chart Data"]
[null,"Key Performance Measures","Costs",null,"Cost Projections","Annual Totals",null,null,null,null,"DATA","LABEL"]
[null,{"$f":"'1. Agency Overview'!B40","v":"EMPLOYMENT"},{"$f":"SUMIF('5. Strategy'!R$14:R$32,Cost!B6,'5. Strategy'!U$14:U$32)","v":0},null,{"$f":"Period","v":2023},{"$f":"SUMIF('5. Strategy'!W$14:W$32,Cost!E6,'5. Strategy'!U$14:U$32)","v":0},null,{"$f":"C6+(ROWS(C6:C$6)/1000*(C6<>0))","v":0},{"$f":"MATCH(SMALL(H:H,COUNTIF(H:H,0)+ROWS(H$6:H6)),H:H,0)","v":8},null,{"$f":"OFFSET($B$5,MATCH(INDEX(H:H,SMALL(OFFSET(I$6,0,0,COUNTIF(H:H,\">0\"),1),ROWS(H$6:H6)),1),H$6:H$15,0),1,1,1)","v":420017.04},{"$f":"OFFSET(B$5,MATCH(INDEX(H:H,SMALL(OFFSET(I$6,0,0,COUNTIF(H:H,\">0\"),1),ROWS(H$6:H6)),1),H$6:H$15,0),0,1,1)","v":"CUSTOMER SERVICE"}]
[null,{"$f":"'1. Agency Overview'!B41","v":"INDEPENDENT LIVING"},{"$f":"SUMIF('5. Strategy'!R$14:R$32,Cost!B7,'5. Strategy'!U$14:U$32)","v":0},null,{"$f":"E6+1","v":2024},{"$f":"SUMIF('5. Strategy'!W$14:W$32,Cost!E7,'5. Strategy'!U$14:U$32)","v":459763.19},null,{"$f":"C7+(ROWS(C$6:C7)/1000*(C7<>0))","v":0},{"$f":"MATCH(SMALL(H:H,COUNTIF(H:H,0)+ROWS(H$6:H7)),H:H,0)","v":9},null,{"$f":"OFFSET($B$5,MATCH(INDEX(H:H,SMALL(OFFSET(I$6,0,0,COUNTIF(H:H,\">0\"),1),ROWS(H$6:H7)),1),H$6:H$15,0),1,1,1)","v":472136.15},{"$f":"OFFSET(B$5,MATCH(INDEX(H:H,SMALL(OFFSET(I$6,0,0,COUNTIF(H:H,\">0\"),1),ROWS(H$6:H7)),1),H$6:H$15,0),0,1,1)","v":"BEST PRACTICES"}]
[null,{"$f":"'1. Agency Overview'!B42","v":"CUSTOMER SERVICE"},{"$f":"SUMIF('5. Strategy'!R$14:R$32,Cost!B8,'5. Strategy'!U$14:U$32)","v":420017.04},null,{"$f":"E7+1","v":2025},{"$f":"SUMIF('5. Strategy'!W$14:W$32,Cost!E8,'5. Strategy'!U$14:U$32)","v":378390},null,{"$f":"C8+(ROWS(C$6:C8)/1000*(C8<>0))","v":420017.04300000001},{"$f":"MATCH(SMALL(H:H,COUNTIF(H:H,0)+ROWS(H$6:H8)),H:H,0)","v":{"$error":"#NUM!"}},null,{"$f":"OFFSET($B$5,MATCH(INDEX(H:H,SMALL(OFFSET(I$6,0,0,COUNTIF(H:H,\">0\"),1),ROWS(H$6:H8)),1),H$6:H$15,0),1,1,1)","v":{"$error":"#NUM!"}},{"$f":"OFFSET(B$5,MATCH(INDEX(H:H,SMALL(OFFSET(I$6,0,0,COUNTIF(H:H,\">0\"),1),ROWS(H$6:H8)),1),H$6:H$15,0),0,1,1)","v":{"$error":"#NUM!"}}]
{"$rows_left_out":8}
{"sheet":"Validation","index":10,"n_rows":25,"n_cols":9,"rows_kept":25,"cut":false,"hidden":true,"merged":[]}
["Budget Period","Control","Principles","Description","Rationale","Implications","Value","Guiding Principles Results","Header"]
[2022,true,"User Focused - Ease of Use","Technology solutions will be designed to optimize the user’s experience while maximizing sharing and reuse of technologies.","Technology solutions need to be user-centric in design, delivery and deployment to maximize business value and adoption.","• Solution process and methods must take the user experience into account.\n• The user’s experience will be optimized based on the user’s authorizations and the capabilities of the user’s device and access channel.\n• User experience solutions will maximize sharing & re-use of technologies and services across all devices and channels for consistency.",true,{"$f":"IFERROR(_xlfn._xlws.FILTER(Validation!C2:C25, G2=Validation!B2:B25),\"\")","v":"User Focused - Ease of Use"},{"$f":"_xlfn.CONCAT(\"Information Technology Modernization Plan:  \",Period,\" - \",FINISH)","v":"Information Technology Modernization Plan:  2023 - 2027"}]
[2023,false,"Controlling Technology Risks","IT risk will be evaluated through standard policies, procedures, and a governance model to identify appropriate mitigations. ","The tradeoffs between business value and risk must be considered at the enterprise level.  Evaluating and communicating acceptable levels of risk will ensure optimum protection of resources within the business and the enterprise overall","• Business-specific technology risks will be managed at the appropriate level (e.g., by Governance bodies and working groups such as IT Governance Committee) in accordance standards, policies, and procedures, and escalated to EIS as appropriate\n• Criteria and thresholds will be defined so independent oversight will occur on technology implementation projects.\n• The solution architecture process will define the solution that meets the business unit’s acceptable risk standard in balance with other factors, including cost and functionality.",null,"Quality Business Data"]
[2024,false,"Focused IT Investments","Management of IT investments (e.g. allocation of IT resources, funding of projects) will align with the strategic objectives and the governance process.","Focusing IT investments on the most important priorities maximizes business benefit achieved from IT resources.","• IT investments will be well-defined by business cases to:\n    o   Provide an analysis of costs, benefits, value and risks\n    o   Demonstrate compliance with need Business Service Levels\n• IT investments will be guided by defined governance with equitable representation from executive, business and technology groups.",null,"Cross-organization Collaboration"]
[2025,false,"Fiscally Responsible Investments","Where possible participate in multi-organization IT initiatives to take advantage of economies of scale, and strive for return on investment, and predictability in technology costs.","Sharing of costs for commonly used IT resources and assets will increase consistency, transparency and cost efficiencies.","• Business group-specific IT resource costs may not be shared.\n• Budgeting, pricing, cost models, allocation practices and reporting will be implemented and communicated across the Enterprise.",null,"Cloud-Smart Approach"]
[2026,false,"Effective Build - Buy Decisions","For best long-term outcomes decisions will follow a rigorous process that will follow a formal framework favoring acquiring the functionality in Commercial of the Shelf (COTS) or Cloud based systems or services, and consider business process re-engineering and custom development as the last alternative.","Clear articulation and adherence to prioritized criteria for reuse / buy / build decisions will ensure greater flexibility, extensibility and cost/time efficiencies in technology solution development, deployment, and maintenance.\n ","• Existing organization technology assets (e.g. applications, services, tools, components and functions) will be documented and available for reuse.\n• Prioritized criteria for reuse/buy/build decisions will be documented and used consistently in analysis for delivering new functionality.\n• For functionality that cannot be acquired business process re-engineering should be considered, and custom development used as the last alternative.\n",null,"Mission First"]
[2027,false,"Modernize the Experience","Running outdated applications causes many problems and challenges, and may not align with business goals. Modernization is focused on improving the employee and customer experience.","Technology is changing rapidly and when it becomes outdated, it isn’t easy to solve bugs and other problems because of a lack of support and services and obsolete systems become difficult to sustain. ","• The organization will take advantage of mainstream technologies and solutions, to minimize lock-in and to make use of best-of-breed solutions.\n• The organization will play an active role defining requirements while adopting common technology standards for future-proofing systems.  \n• Business technology solutions will align with the state Enterprise Architecture principles to the benefit of the organization.  \n",null,"Advance Diversity, Equity, Inclusion"]
[2028,false,"Meet Standards & Compliance","IT solutions and services will comply with security, privacy, technical, and other standards, and will meet appropriate audit, regulatory and legal requirements. ","Well-documented and consistent adoption of organization standards will protect enterprise resources.","• Organization standards will be reviewed and communicated on an on-going basis to ensure compliance.\n• This principle should be applied when negotiating IT service contracts."]
{"$rows_left_out":17}