{"text_format":"1","workbook":"xlsx","n_sheets":10,"sheets":["Introduction","1. Agency Overview","2. Guiding Principles","3. Linkages","4. SWOT","5. Strategy","6. Resulting Strategic Plan","Timeline","Cost","Validation"],"not_rendered":{"charts":8,"images":3,"macros":1,"external_links":0,"defined_names":18,"comments":0,"pivot_tables":0},"unopened":[],"bounds":{"document_bytes":16777216,"sheet_cells":100000,"rows_first":2000,"rows_last":500,"rows_between":2000,"halvings":0,"cell_chars":16384,"cell_head_chars":4096},"cells_cut":0,"cells_raw":0,"read":"whole","date_system":"1900"}

{"sheet":"Introduction","index":0,"n_rows":33,"n_cols":4,"rows_kept":33,"cut":false,"hidden":false,"merged":[[32,1,32,13],[14,1,14,13],[31,1,31,13],[20,1,20,13],[23,1,23,13],[26,1,26,13],[29,1,29,13],[17,1,17,13],[19,1,19,13],[22,1,22,13],[25,1,25,13],[28,1,28,13],[8,1,8,13],[4,1,4,13],[11,1,11,13],[1,3,1,13],[2,3,2,13]]}
[]
[null,null,null,"IT Modernization Planning Workbook"]
[null,null,null,"for Small-Scale Organizations"]
[]
[null,"Please ensure you engage your Assistant State Chief Information Officer while using this template!"]
[]
[]
[null,"Purpose:"]
{"$rows_left_out":26}
{"sheet":"1. Agency Overview","index":1,"n_rows":47,"n_cols":4,"rows_kept":47,"cut":false,"hidden":false,"merged":[[44,3,44,11],[45,3,45,11],[46,3,46,11],[47,3,47,11],[38,3,38,11],[39,3,39,11],[40,3,40,11],[41,3,41,11],[42,3,42,11],[43,3,43,11],[30,1,30,11],[31,1,31,11],[32,1,32,11],[33,1,33,11],[36,1,36,11],[35,1,35,11],[29,1,29,11],[12,1,12,11],[16,1,16,11],[18,1,18,11],[19,1,19,11],[20,1,20,11],[21,1,21,11],[22,1,22,11],[23,1,23,11],[25,1,25,11],[27,1,27,11],[28,1,28,11],[9,1,9,11],[13,1,13,11],[17,1,17,11],[26,1,26,11],[4,1,4,11],[8,1,8,11],[5,1,5,11],[6,1,6,11],[10,1,10,11],[14,1,14,11]]}
[]
[null,"STEP 1:  Setting the Strategic Foundation"]
[null,"Fill in each field with the associated organization related information"]
[]
[null,"Organization Name"]
[null,"Insert the organization’s name"]
[null,"Contruction Contractors Board"]
[]
{"$rows_left_out":40}
{"sheet":"2. Guiding Principles","index":2,"n_rows":27,"n_cols":7,"rows_kept":27,"cut":false,"hidden":false,"merged":[[4,1,4,5],[25,1,26,1],[13,1,14,1],[16,1,17,1],[19,1,20,1],[22,1,23,1]]}
[]
[null,"STEP 2:  Determining Guiding Principles"]
[]
[null,"Setting the Vision for use of Technologies"]
[null,"The principles below should guide every IT decision and set the boundaries of what is acceptable. Business leaders should lead the process of deciding what the key drivers are for automation (a.k.a. IT governance process), as well as the importance of how it is operated and supported.\n\nWhere practical, making IT decisions should be a partnership, leveraging both enterprise and localized resources to meet the strategic goals of the organization, and requiring discussions that ensure the optimal use of limited IT resources. In collaborative organizations decision-makers are often asked to balance seemingly conflicting requirements; e.g., innovation vs. stability, standardization vs. autonomy, openness vs. security, consensus vs. efficiency in decision making, centralized vs. distributed services, and closed proprietary systems vs. public open source possibilities. By embracing guiding principles at the onset of the IT governance process the endeavor to balance the needs becomes clearer, and will lead to organizational goals being met."]
[]
[null,"Guiding Principles"]
[null,"Check the boxes for each guiding principle driving IT need - Pick the key values that resonate within the organization (Generally 3 to 5 is sufficient)"]
{"$rows_left_out":20}
{"sheet":"3. Linkages","index":3,"n_rows":27,"n_cols":5,"rows_kept":27,"cut":false,"hidden":false,"merged":[[26,2,26,13],[21,2,21,13],[22,2,22,13],[23,2,23,13],[24,2,24,13],[25,2,25,13],[20,2,20,13],[4,2,4,13],[7,2,7,13],[9,4,9,13],[10,4,10,13],[11,4,11,13],[12,4,12,13],[13,4,13,13],[14,4,14,13],[15,4,15,13],[16,2,16,13],[19,2,19,13]]}
[]
[null,null,"STEP 3:  Linking Business Goals to Initiatives"]
[]
[null,null,"Purpose of a Strategic Plan"]
[null,null,"A plan helps guide an organization as it formulates its overall strategy. While an information technology (IT) strategy focuses on how automation will help the business succeed, an IT strategic plan is a roadmap to help the business implement those strategies. The plan outlines areas where automation can contribute business value and where an organization can gain advantage by making the best use of technology resources. An IT strategic plan documents the relationship of business goals and the use of technology to enabled effective and efficient business processes. It serves as a guide to IT-related decision making, with IT tasks prioritized and implemented using the plan as a framework."]
[]
[null,null,"Where to Start"]
[null,null,"Using basic Lean practices it is easy to spot areas where improvement can be made, and where investment in automation can make a difference. There are generally eight categories of inefficiencies, or what is referred to as \"Waste\". The outline below is an example framework of waste as where automation can be used for improvements:"]
{"$rows_left_out":20}
{"sheet":"4. SWOT","index":4,"n_rows":48,"n_cols":3,"rows_kept":48,"cut":false,"hidden":false,"merged":[[35,1,35,2],[11,1,11,2],[4,1,4,2],[3,1,3,2]]}
[]
[null,"STEP 4:  SWOT Analysis (Optional)"]
[]
[null,"Strength, Weakness, Opportunities, Threats Tool"]
[null,"SWOT analysis is a strategic planning technique to identifying core strengths, weaknesses, opportunities, and threats that leads to fact-based analysis, fresh perspectives, and new ideas.\n\nA SWOT analysis pulls information from internal sources (strengths of weaknesses of the agency) as well as external forces that may have uncontrollable impacts to decisions (opportunities and threats). SWOT analysis works best when diverse groups or voices within an agency are free to provide realistic data points rather than prescribed messaging. Findings of a SWOT analysis are often synthesized to support a focused set of objective or decision that an agency is facing."]
[]
[null,"Strength Example Questions","Weakness Example Questions"]
[null,"1. What are we doing well?\n2. What resources do we have?\n3. What is our strongest asset?","1. Where can we improve?\n2. What services are underperforming?\n3. Where are we lacking resources?"]
{"$rows_left_out":41}
{"sheet":"5. Strategy","index":5,"n_rows":32,"n_cols":26,"rows_kept":32,"cut":false,"hidden":false,"merged":[[9,17,9,18],[7,8,7,11],[9,20,9,23],[9,14,9,15],[13,9,13,12],[4,2,4,13],[7,2,7,4],[18,1,19,1],[10,9,10,12],[10,2,10,7],[13,2,13,7],[16,2,16,7],[19,2,19,7],[12,2,12,7],[12,9,12,12],[12,1,13,1],[15,2,15,7],[15,9,15,12],[15,1,16,1],[18,9,18,12],[16,9,16,12],[18,2,18,7],[21,2,21,7],[21,9,21,12],[21,1,22,1],[9,2,9,7],[9,9,9,12],[22,2,22,7],[22,9,22,12],[19,9,19,12],[24,1,25,1],[27,1,28,1],[30,1,31,1],[31,2,31,7],[31,9,31,12],[25,9,25,12],[28,9,28,12],[25,2,25,7],[28,2,28,7],[24,2,24,7],[24,9,24,12],[27,2,27,7],[27,9,27,12],[30,2,30,7],[30,9,30,12]]}
[]
[null,null,"STEP 5:  Linking Business Goals to Initiatives"]
[]
[null,null,"Planning is a Step-wise Process"]
[null,null,"Tying business goals to actions is a series of connected planning activities simplified in the steps below. Start with selecting the key business goals to be addressed, and follow the sequenced steps 1 through 7 (left to right) to outline a framework for an IT Strategic Plan. The result demonstrates a clear linkage between organization goals, the improvement opportunity, and how it will affect the business key performance measures. Each item is automatically rolled up into a one-page plan overview on the \"4. Resulting Modernization Plan\" tab."]
[]
[null,null,"Building the Information Technology Modernization Action Plan"]
[null,null,"Select Start Year for Plan:",null,null,2023,null,null,"Select Finish Year for Plan:",null,null,null,2027]
{"$rows_left_out":25}
{"sheet":"6. Resulting Strategic Plan","index":6,"n_rows":66,"n_cols":89,"rows_kept":66,"cut":false,"hidden":false,"merged":[[65,30,68,55],[49,30,49,55],[45,30,48,55],[50,30,53,55],[59,30,59,55],[55,30,58,55],[64,30,64,55],[60,30,63,55],[13,88,14,113],[17,88,18,113],[21,88,22,113],[25,88,26,113],[29,88,30,113],[23,88,24,113],[27,88,28,113],[17,30,20,55],[21,30,24,55],[25,30,28,55],[29,30,32,55],[13,59,14,84],[17,59,18,84],[21,59,22,84],[25,59,26,84],[29,59,30,84],[27,59,28,84],[23,59,24,84],[45,59,46,84],[41,29,42,56],[54,30,54,55],[58,88,59,113],[43,87,44,114],[43,58,44,85],[45,88,46,113],[43,30,44,55],[27,2,28,26],[29,2,32,26],[33,2,36,26],[37,2,40,26],[41,2,44,26],[33,30,36,55],[37,30,40,55],[19,88,20,113],[15,59,16,84],[39,88,40,113],[35,59,36,84],[37,59,38,84],[39,59,40,84],[33,59,34,84],[31,59,32,84],[33,88,34,113],[37,88,38,113],[13,86,15,86],[31,88,32,113],[35,88,36,113],[13,30,16,55],[11,30,12,55],[19,59,20,84],[45,2,48,26],[49,2,52,26],[0,23,3,99],[9,1,10,27],[11,2,12,26],[21,2,26,26],[19,2,20,26],[13,2,18,26],[11,88,12,113],[11,59,12,84],[9,29,10,56],[9,58,10,85],[9,87,10,114],[15,88,16,113]]}
[]
[]
[]
[]
[]
[]
[]
[]
{"$rows_left_out":59}
{"sheet":"Timeline","index":7,"n_rows":20,"n_cols":9,"rows_kept":20,"cut":false,"hidden":false,"merged":[[5,6,5,8],[15,1,15,8]]}
[]
[null,"AUTOMATIC:  Timeline for Initiatives"]
[]
[null,"Chart Start Date",{"$f":"DATE(Period,1,1)","v":"2023-01-01"},{"$f":"PT_ScaleChartAxis(\"Timeline\",\"Chart 31\",\"Y\",\"Primary\",C4,C5,C6,0)","v":{"$error":"#NAME?"}}]
[null,"Chart End Date",{"$f":"DATE(FINISH,12,31)","v":"2027-12-31"}]
[null,"Time Units",366,null,null,null,"Calculated"]
[null,"Project Name","Planned Start","Actual Start","Planned Finished","Forecasted Finish","Start Variance","Slip","Finish Variance"]
[null,{"$f":"IF('5. Strategy'!O14=0,\"\",'5. Strategy'!O14)","v":"Licensing System Replacement"},{"$f":"IF('5. Strategy'!V14=0,\"\",'5. Strategy'!V14)","v":"2024-02-01"},{"$f":"Table113[[#This Row],[Planned Start]]","v":"2024-02-01"},{"$f":"IF('5. Strategy'!V14=0,\"\",'5. Strategy'!V14+('5. Strategy'!X14*30))","v":"2027-01-16"},{"$f":"Table113[[#This Row],[Planned Finished]]","v":"2027-01-16"},{"$f":"IFERROR(D8-C8,\"\")","v":0},{"$f":"IFERROR(IF(F8>E8,E8-D8,((E8-D8)+(F8-E8))),\"\")","v":1080},{"$f":"IFERROR(IF(D8>E8,E8-D8,0)+F8-E8,\"\")","v":0}]
{"$rows_left_out":13}
{"sheet":"Cost","index":8,"n_rows":23,"n_cols":25,"rows_kept":23,"cut":false,"hidden":false,"merged":[[13,24,14,24],[13,13,14,13],[13,14,14,14],[13,15,14,15],[13,16,14,16],[13,17,14,17],[13,18,14,18],[13,19,14,19],[13,20,14,20],[13,21,14,21],[13,22,14,22],[13,23,14,23]]}
[]
[null,"AUTOMATIC:  Investment Calculations"]
[]
[null,"Investment by Goal",null,null,"Year over Year",null,null,"Temporary Data",null,null,"Donut Chart Data",null,null,"Simple 12 Month Spend Allocation "]
[null,"Key Performance Measures","Costs",null,"Cost Projections","Annual Totals",null,null,null,null,"DATA","LABEL",null,"Start Date","Total Months","Months in Year 1","Months in Year 2","Months in Year 3","Months in Year 4","Months in Year 5","Months in Year 6","Months in Year 7","Months in Year 8","Months in Year 9","Months in Year 10"]
[null,{"$f":"'1. Agency Overview'!B39","v":"Homeowner Awareness"},{"$f":"SUMIF('5. Strategy'!R$14:R$32,Cost!B6,'5. Strategy'!U$14:U$32)","v":0},null,{"$f":"Period","v":2023},{"$f":"IF(E6<>\"\",O23,\"\")","v":0},null,{"$f":"C6+(ROWS(C6:C$6)/1000*(C6<>0))","v":0},{"$f":"MATCH(SMALL(H:H,COUNTIF(H:H,0)+ROWS(H$6:H6)),H:H,0)","v":14},null,{"$f":"OFFSET($B$5,MATCH(INDEX(H:H,SMALL(OFFSET(I$6,0,0,COUNTIF(H:H,\">0\"),1),ROWS(H$6:H6)),1),H$6:H$15,0),1,1,1)","v":20000},{"$f":"OFFSET(B$5,MATCH(INDEX(H:H,SMALL(OFFSET(I$6,0,0,COUNTIF(H:H,\">0\"),1),ROWS(H$6:H6)),1),H$6:H$15,0),0,1,1)","v":"Enforcement Investigations"},null,{"$f":"'5. Strategy'!V14","v":"2024-02-01"},{"$f":"'5. Strategy'!X14","v":36},{"$f":"13-MONTH('5. Strategy'!V14)","v":11},{"$f":"IF((O6-P6)<0,0,IF((O6-P6)>12,12,(O6-P6)))","v":12},{"$f":"IF((O6-P6-Q6)<0,0,IF((O6-P6-Q6)>12,12,(O6-P6-Q6)))","v":12},{"$f":"IF(R6=0,0,IF((O6-P6-Q6-R6)>12,12, (O6-P6-Q6-R6)))","v":1},{"$f":"IF(S6=0,0,IF((O6-P6-Q6-R6-S6)>12,12, (O6-P6-Q6-R6-S6)))","v":0},{"$f":"IF(T6=0,0,IF((O6-P6-Q6-R6-S6-T6)>12,12, (O6-P6-Q6-R6-S6-T6)))","v":0},{"$f":"IF(U6=0,0,IF((O6-P6-Q6-R6-S6-T6-U6)>12,12, (O6-P6-Q6-R6-S6-T6-U6)))","v":0},{"$f":"IF(V6=0,0,IF((O6-P6-Q6-R6-S6-T6-U6-V6)>12,12, (O6-P6-Q6-R6-S6-T6-U6-V6)))","v":0},{"$f":"IF(W6=0,0,IF((O6-P6-Q6-R6-S6-T6-U6-V6-W6)>12,12, (O6-P6-Q6-R6-S6-T6-U6-V6-W6)))","v":0},{"$f":"IF(X6=0,0,IF((O6-P6-Q6-R6-S6-T6-U6-V6-W6-X6)>12,12, (O6-P6-Q6-R6-S6-T6-U6-V6-W6-X6)))","v":0}]
[null,{"$f":"'1. Agency Overview'!B40","v":"Unlicensed Recidivism Rate"},{"$f":"SUMIF('5. Strategy'!R$14:R$32,Cost!B7,'5. Strategy'!U$14:U$32)","v":0},null,{"$f":"IF(E6+1<=FINISH, E6+1,\"\")","v":2024},{"$f":"IF(E7<>\"\",P$23,\"\")","v":366666.66666666669},null,{"$f":"C7+(ROWS(C$6:C7)/1000*(C7<>0))","v":0},{"$f":"MATCH(SMALL(H:H,COUNTIF(H:H,0)+ROWS(H$6:H7)),H:H,0)","v":9},null,{"$f":"OFFSET($B$5,MATCH(INDEX(H:H,SMALL(OFFSET(I$6,0,0,COUNTIF(H:H,\">0\"),1),ROWS(H$6:H7)),1),H$6:H$15,0),1,1,1)","v":1200000},{"$f":"OFFSET(B$5,MATCH(INDEX(H:H,SMALL(OFFSET(I$6,0,0,COUNTIF(H:H,\">0\"),1),ROWS(H$6:H7)),1),H$6:H$15,0),0,1,1)","v":"License and Renewal Processing"},null,{"$f":"'5. Strategy'!V17","v":"2025-01-01"},{"$f":"'5. Strategy'!X17","v":6},{"$f":"13-MONTH('5. Strategy'!V17)","v":12},0,0,{"$f":"IF(R7=0,0,IF((O7-P7-Q7-R7)>12,12, (O7-P7-Q7-R7)))","v":0},{"$f":"IF(S7=0,0,IF((O7-P7-Q7-R7-S7)>12,12, (O7-P7-Q7-R7-S7)))","v":0},{"$f":"IF(T7=0,0,IF((O7-P7-Q7-R7-S7-T7)>12,12, (O7-P7-Q7-R7-S7-T7)))","v":0},{"$f":"IF(U7=0,0,IF((O7-P7-Q7-R7-S7-T7-U7)>12,12, (O7-P7-Q7-R7-S7-T7-U7)))","v":0},{"$f":"IF(V7=0,0,IF((O7-P7-Q7-R7-S7-T7-U7-V7)>12,12, (O7-P7-Q7-R7-S7-T7-U7-V7)))","v":0},{"$f":"IF(W7=0,0,IF((O7-P7-Q7-R7-S7-T7-U7-V7-W7)>12,12, (O7-P7-Q7-R7-S7-T7-U7-V7-W7)))","v":0},{"$f":"IF(X7=0,0,IF((O7-P7-Q7-R7-S7-T7-U7-V7-W7-X7)>12,12, (O7-P7-Q7-R7-S7-T7-U7-V7-W7-X7)))","v":0}]
[null,{"$f":"'1. Agency Overview'!B41","v":"Contractors Who Fail to Pay Damages"},{"$f":"SUMIF('5. Strategy'!R$14:R$32,Cost!B8,'5. Strategy'!U$14:U$32)","v":0},null,{"$f":"IF(E7+1<=FINISH, E7+1,\"\")","v":2025},{"$f":"IF(E8<>\"\",Q$23,\"\")","v":452000},null,{"$f":"C8+(ROWS(C$6:C8)/1000*(C8<>0))","v":0},{"$f":"MATCH(SMALL(H:H,COUNTIF(H:H,0)+ROWS(H$6:H8)),H:H,0)","v":12},null,{"$f":"OFFSET($B$5,MATCH(INDEX(H:H,SMALL(OFFSET(I$6,0,0,COUNTIF(H:H,\">0\"),1),ROWS(H$6:H8)),1),H$6:H$15,0),1,1,1)","v":12000},{"$f":"OFFSET(B$5,MATCH(INDEX(H:H,SMALL(OFFSET(I$6,0,0,COUNTIF(H:H,\">0\"),1),ROWS(H$6:H8)),1),H$6:H$15,0),0,1,1)","v":"Best Practices "},null,{"$f":"'5. Strategy'!V20","v":"00:00:00"},{"$f":"'5. Strategy'!X20","v":0},{"$f":"13-MONTH('5. Strategy'!V20)","v":12},0,0,0,0,0,0,0,0,0]
{"$rows_left_out":16}
{"sheet":"Validation","index":9,"n_rows":25,"n_cols":9,"rows_kept":25,"cut":false,"hidden":true,"merged":[]}
["Budget Period","Control","Principles","Description","Rationale","Implications","Value","Guiding Principles Results","Header"]
[2022,true,"User Focused - Ease of Use","Technology solutions will be designed to optimize the user’s experience while maximizing sharing and reuse of technologies.","Technology solutions need to be user-centric in design, delivery and deployment to maximize business value and adoption.","• Solution process and methods must take the user experience into account.\n• The user’s experience will be optimized based on the user’s authorizations and the capabilities of the user’s device and access channel.\n• User experience solutions will maximize sharing & re-use of technologies and services across all devices and channels for consistency.",true,{"$f":"IFERROR(_xlfn._xlws.FILTER(Validation!C2:C25, G2=Validation!B2:B25),\"\")","v":"User Focused - Ease of Use"},{"$f":"_xlfn.CONCAT(\"Information Technology Strategic Plan:  \",Period,\" - \",FINISH)","v":"Information Technology Strategic Plan:  2023 - 2027"}]
[2023,false,"Controlling Technology Risks","IT risk will be evaluated through standard policies, procedures, and a governance model to identify appropriate mitigations. ","The tradeoffs between business value and risk must be considered at the enterprise level.  Evaluating and communicating acceptable levels of risk will ensure optimum protection of resources within the business and the enterprise overall","• Business-specific technology risks will be managed at the appropriate level (e.g., by Governance bodies and working groups such as IT Governance Committee) in accordance standards, policies, and procedures, and escalated to EIS as appropriate\n• Criteria and thresholds will be defined so independent oversight will occur on technology implementation projects.\n• The solution architecture process will define the solution that meets the business unit’s acceptable risk standard in balance with other factors, including cost and functionality.",null,"Modernize the Experience"]
[2024,false,"Focused IT Investments","Management of IT investments (e.g. allocation of IT resources, funding of projects) will align with the strategic objectives and the governance process.","Focusing IT investments on the most important priorities maximizes business benefit achieved from IT resources.","• IT investments will be well-defined by business cases to:\n    o   Provide an analysis of costs, benefits, value and risks\n    o   Demonstrate compliance with need Business Service Levels\n• IT investments will be guided by defined governance with equitable representation from executive, business and technology groups.",null,"Strategic Adopting of New Technologies"]
[2025,false,"Fiscally Responsible Investments","Where possible participate in multi-organization IT initiatives to take advantage of economies of scale, and strive for return on investment, and predictability in technology costs.","Sharing of costs for commonly used IT resources and assets will increase consistency, transparency and cost efficiencies.","• Business group-specific IT resource costs may not be shared.\n• Budgeting, pricing, cost models, allocation practices and reporting will be implemented and communicated across the Enterprise.",null,"Innovation and Continuous Improvement"]
[2026,false,"Effective Build - Buy Decisions","For best long-term outcomes decisions will follow a rigorous process that will follow a formal framework favoring acquiring the functionality in Commercial of the Shelf (COTS) or Cloud based systems or services, and consider business process re-engineering and custom development as the last alternative.","Clear articulation and adherence to prioritized criteria for reuse / buy / build decisions will ensure greater flexibility, extensibility and cost/time efficiencies in technology solution development, deployment, and maintenance.\n ","• Existing organization technology assets (e.g. applications, services, tools, components and functions) will be documented and available for reuse.\n• Prioritized criteria for reuse/buy/build decisions will be documented and used consistently in analysis for delivering new functionality.\n• For functionality that cannot be acquired business process re-engineering should be considered, and custom development used as the last alternative.\n",null,"Quality Business Data"]
[2027,true,"Modernize the Experience","Running outdated applications causes many problems and challenges, and may not align with business goals. Modernization is focused on improving the employee and customer experience.","Technology is changing rapidly and when it becomes outdated, it isn’t easy to solve bugs and other problems because of a lack of support and services and obsolete systems become difficult to sustain. ","• The organization will take advantage of mainstream technologies and solutions, to minimize lock-in and to make use of best-of-breed solutions.\n• The organization will play an active role defining requirements while adopting common technology standards for future-proofing systems.  \n• Business technology solutions will align with the state Enterprise Architecture principles to the benefit of the organization.  \n"]
[2028,false,"Meet Standards & Compliance","IT solutions and services will comply with security, privacy, technical, and other standards, and will meet appropriate audit, regulatory and legal requirements. ","Well-documented and consistent adoption of organization standards will protect enterprise resources.","• Organization standards will be reviewed and communicated on an on-going basis to ensure compliance.\n• This principle should be applied when negotiating IT service contracts."]
{"$rows_left_out":17}