{"text_format":"1","workbook":"xlsx","n_sheets":6,"sheets":["Step 1","Utility PickList","Step 2","Historical Facilities Look Up","Facilities Look Up","EPEs"],"not_rendered":{"charts":0,"images":2,"macros":1,"external_links":5,"defined_names":41,"comments":0,"pivot_tables":0},"unopened":[],"bounds":{"document_bytes":16777216,"sheet_cells":100000,"rows_first":2000,"rows_last":500,"rows_between":2000,"halvings":0,"cell_chars":16384,"cell_head_chars":4096},"cells_cut":0,"cells_raw":0,"read":"whole","date_system":"1900"}

{"sheet":"Step 1","index":0,"n_rows":45,"n_cols":4,"rows_kept":45,"cut":false,"hidden":false,"merged":[[8,3,8,4],[44,2,44,3],[32,2,32,3],[33,2,33,3],[37,2,37,3],[39,2,39,3],[0,1,0,4],[26,2,26,3],[28,2,28,3],[43,2,43,3],[12,2,12,3],[24,2,24,3],[20,2,20,3],[18,2,18,3],[19,2,19,3],[17,2,17,3],[9,3,9,4],[16,2,16,3],[1,1,1,4],[2,1,2,4],[3,1,3,4],[4,1,4,4]]}
[null,"Oregon DEQ Greenhouse Gas Reporting Progam"]
[null,"Specified Source Facilities Registration Workbook"]
[null,"Electricity Generating Facility Registration for Specified Sources"]
[null,"Version: RY2020"]
[null,"Finalized: 1/25/2021"]
[]
[null,null,"Reporting Entity Information:"]
[]
[null,null,"Entity Name: \n\n     If not listed, contact CARB to register your EPE & request a personalized registration workbook",""]
[null,null,"Emission Year",2020]
[]
[]
[null,null,"The Oregon Department of Environmental Quality (DEQ) is providing this Specified Source Registration Workbook to electricity suppliers that serve electricity to end users in Oregon (or are third parties reporting on behalf of consumer-owned utilities) for the registration of anticipated specified source facilities or units for use in reporting calendar year 2020 emissions.\n\nIn advance of the reporting deadline, electricity suppliers (or third party reporters) must register their anticipated specified sources of power that they intend to claim in their 2020 Emissions Data Reports pursuant to OAR 340-215-0120.  In the event of an unforeseen or extenuating circumstance, if a facility was not registered in advance, electricity generating facility information should listed in this workbook and uploaded as an attachment during emissions reporting.                                                                                                                                                                                         “Specified source of electricity” or “specified source” means a facility or unit which is allowed to be claimed as the source of electricity delivered. The regulated entity must have either full or partial ownership of the facility or unit, or a written power contract to procure electricity generated by that facility or unit. Specified facilities or units include cogeneration systems. Specified source also means electricity procured from an asset-controlling supplier recognized by DEQ.                                                                                                                                                                                                                                                               "]
[]
[]
[]
[null,null,"Form Instructions"]
[null,null,"Electricity suppliers should report all specified sources for electricity delivered or distributed to end users in this state during the previous year, regardless of whether the electricity was generated in Oregon or imported.  Although electricity purchased through an energy imbalance market or other centralized market will be assigned the default unspecified emission factor, these sources should still be registered on this form.   "]
[null,null,"Multijurisdictional electricity suppliers and asset controlling suppliers should report all specified sources for electricity in the utility's service territory or power system, including specified sources for wholesale electricity purchases, generation, and sales. "]
[null,null,"A request to register a unit (as opposed to a facility) must be justified in writing with submittal of this form. A unit must be written in a contract as a specified source of power or owned by a utility for consideration of registration. DEQ will review all requests on a unit by unit basis, and will inform you if the request was approved (or disapproved). "]
{"$rows_left_out":26}
{"sheet":"Utility PickList","index":1,"n_rows":22,"n_cols":12,"rows_kept":22,"cut":false,"hidden":true,"merged":[]}
["Reporting Entities"]
["Select reporting entity from drop-down"]
["Idaho Power",{"$f":"--ISNUMBER(IFERROR(SEARCH('Step 1'!$D$9,A3,1),\"\"))","v":1},{"$f":"IF(B3=1,COUNTIF($B$3:B3,1),\"\")","v":1},{"$f":"IFERROR(INDEX($A$3:$A$22,MATCH(ROWS($C$3:C3),$C$3:$C$22,0)),\"\")","v":"Idaho Power"},null,null,null,null,null,null,null,"Yes"]
["Pacific Power (PacifiCorp)",{"$f":"--ISNUMBER(IFERROR(SEARCH('Step 1'!$D$9,A4,1),\"\"))","v":1},{"$f":"IF(B4=1,COUNTIF($B$3:B4,1),\"\")","v":2},{"$f":"IFERROR(INDEX($A$3:$A$22,MATCH(ROWS($C$3:C4),$C$3:$C$22,0)),\"\")","v":"Pacific Power (PacifiCorp)"},null,null,null,null,null,null,null,"No"]
["Portland General Electric (PGE)",{"$f":"--ISNUMBER(IFERROR(SEARCH('Step 1'!$D$9,A5,1),\"\"))","v":1},{"$f":"IF(B5=1,COUNTIF($B$3:B5,1),\"\")","v":3},{"$f":"IFERROR(INDEX($A$3:$A$22,MATCH(ROWS($C$3:C5),$C$3:$C$22,0)),\"\")","v":"Portland General Electric (PGE)"},null,null,null,null,null,null,null,"Partial Ownership"]
["3 Phases Renewables ",{"$f":"--ISNUMBER(IFERROR(SEARCH('Step 1'!$D$9,A6,1),\"\"))","v":1},{"$f":"IF(B6=1,COUNTIF($B$3:B6,1),\"\")","v":4},{"$f":"IFERROR(INDEX($A$3:$A$22,MATCH(ROWS($C$3:C6),$C$3:$C$22,0)),\"\")","v":"3 Phases Renewables "}]
["Avangrid Renewables",{"$f":"--ISNUMBER(IFERROR(SEARCH('Step 1'!$D$9,A7,1),\"\"))","v":1},{"$f":"IF(B7=1,COUNTIF($B$3:B7,1),\"\")","v":5},{"$f":"IFERROR(INDEX($A$3:$A$22,MATCH(ROWS($C$3:C7),$C$3:$C$22,0)),\"\")","v":"Avangrid Renewables"}]
["Calpine Energy Solutions",{"$f":"--ISNUMBER(IFERROR(SEARCH('Step 1'!$D$9,A8,1),\"\"))","v":1},{"$f":"IF(B8=1,COUNTIF($B$3:B8,1),\"\")","v":6},{"$f":"IFERROR(INDEX($A$3:$A$22,MATCH(ROWS($C$3:C8),$C$3:$C$22,0)),\"\")","v":"Calpine Energy Solutions"},null,null,null,null,null,null,null,"https://www.youtube.com/watch?v=Ea_ACp5W8zI"]
["Constellation New Energy",{"$f":"--ISNUMBER(IFERROR(SEARCH('Step 1'!$D$9,A9,1),\"\"))","v":1},{"$f":"IF(B9=1,COUNTIF($B$3:B9,1),\"\")","v":7},{"$f":"IFERROR(INDEX($A$3:$A$22,MATCH(ROWS($C$3:C9),$C$3:$C$22,0)),\"\")","v":"Constellation New Energy"},null,null,null,null,null,null,null,"Don’t have office 365, so don't have filter function?"]
["Shell Energy North America",{"$f":"--ISNUMBER(IFERROR(SEARCH('Step 1'!$D$9,A10,1),\"\"))","v":1},{"$f":"IF(B10=1,COUNTIF($B$3:B10,1),\"\")","v":8},{"$f":"IFERROR(INDEX($A$3:$A$22,MATCH(ROWS($C$3:C10),$C$3:$C$22,0)),\"\")","v":"Shell Energy North America"}]
["Bonneville Power Administration",{"$f":"--ISNUMBER(IFERROR(SEARCH('Step 1'!$D$9,A11,1),\"\"))","v":1},{"$f":"IF(B11=1,COUNTIF($B$3:B11,1),\"\")","v":9},{"$f":"IFERROR(INDEX($A$3:$A$22,MATCH(ROWS($C$3:C11),$C$3:$C$22,0)),\"\")","v":"Bonneville Power Administration"}]
["Clatskanie PUD",{"$f":"--ISNUMBER(IFERROR(SEARCH('Step 1'!$D$9,A12,1),\"\"))","v":1},{"$f":"IF(B12=1,COUNTIF($B$3:B12,1),\"\")","v":10},{"$f":"IFERROR(INDEX($A$3:$A$22,MATCH(ROWS($C$3:C12),$C$3:$C$22,0)),\"\")","v":"Clatskanie PUD"}]
["Columbia Rural Electric (Columbia REA)",{"$f":"--ISNUMBER(IFERROR(SEARCH('Step 1'!$D$9,A13,1),\"\"))","v":1},{"$f":"IF(B13=1,COUNTIF($B$3:B13,1),\"\")","v":11},{"$f":"IFERROR(INDEX($A$3:$A$22,MATCH(ROWS($C$3:C13),$C$3:$C$22,0)),\"\")","v":"Columbia Rural Electric (Columbia REA)"}]
["Emerald PUD",{"$f":"--ISNUMBER(IFERROR(SEARCH('Step 1'!$D$9,A14,1),\"\"))","v":1},{"$f":"IF(B14=1,COUNTIF($B$3:B14,1),\"\")","v":12},{"$f":"IFERROR(INDEX($A$3:$A$22,MATCH(ROWS($C$3:C14),$C$3:$C$22,0)),\"\")","v":"Emerald PUD"}]
["Eugene Water & Electric Board (EWEB)",{"$f":"--ISNUMBER(IFERROR(SEARCH('Step 1'!$D$9,A15,1),\"\"))","v":1},{"$f":"IF(B15=1,COUNTIF($B$3:B15,1),\"\")","v":13},{"$f":"IFERROR(INDEX($A$3:$A$22,MATCH(ROWS($C$3:C15),$C$3:$C$22,0)),\"\")","v":"Eugene Water & Electric Board (EWEB)"}]
["Forest Grove Light & Power",{"$f":"--ISNUMBER(IFERROR(SEARCH('Step 1'!$D$9,A16,1),\"\"))","v":1},{"$f":"IF(B16=1,COUNTIF($B$3:B16,1),\"\")","v":14},{"$f":"IFERROR(INDEX($A$3:$A$22,MATCH(ROWS($C$3:C16),$C$3:$C$22,0)),\"\")","v":"Forest Grove Light & Power"}]
["Harney Electric Cooperative",{"$f":"--ISNUMBER(IFERROR(SEARCH('Step 1'!$D$9,A17,1),\"\"))","v":1},{"$f":"IF(B17=1,COUNTIF($B$3:B17,1),\"\")","v":15},{"$f":"IFERROR(INDEX($A$3:$A$22,MATCH(ROWS($C$3:C17),$C$3:$C$22,0)),\"\")","v":"Harney Electric Cooperative"}]
["Milton-Freewater City Light & Power",{"$f":"--ISNUMBER(IFERROR(SEARCH('Step 1'!$D$9,A18,1),\"\"))","v":1},{"$f":"IF(B18=1,COUNTIF($B$3:B18,1),\"\")","v":16},{"$f":"IFERROR(INDEX($A$3:$A$22,MATCH(ROWS($C$3:C18),$C$3:$C$22,0)),\"\")","v":"Milton-Freewater City Light & Power"}]
["Northern Wasco PUD",{"$f":"--ISNUMBER(IFERROR(SEARCH('Step 1'!$D$9,A19,1),\"\"))","v":1},{"$f":"IF(B19=1,COUNTIF($B$3:B19,1),\"\")","v":17},{"$f":"IFERROR(INDEX($A$3:$A$22,MATCH(ROWS($C$3:C19),$C$3:$C$22,0)),\"\")","v":"Northern Wasco PUD"}]
["PNGC Power",{"$f":"--ISNUMBER(IFERROR(SEARCH('Step 1'!$D$9,A20,1),\"\"))","v":1},{"$f":"IF(B20=1,COUNTIF($B$3:B20,1),\"\")","v":18},{"$f":"IFERROR(INDEX($A$3:$A$22,MATCH(ROWS($C$3:C20),$C$3:$C$22,0)),\"\")","v":"PNGC Power"}]
{"$rows_left_out":3}
{"sheet":"Step 2","index":2,"n_rows":312,"n_cols":17,"rows_kept":312,"cut":false,"hidden":false,"merged":[[12,7,12,10],[12,1,12,4],[10,6,10,10],[0,0,0,10],[6,0,6,4],[6,6,6,10],[7,0,7,4],[8,0,8,4],[9,6,9,10],[9,0,9,4],[1,0,1,10],[2,0,2,10],[4,0,4,10],[3,0,3,10],[7,6,8,10]]}
["Instructions"]
["Register all anticipated specified sources of power that you intend to claim for your reporting entity's 2020 Emissions Data Report to the Oregon DEQ Greenhouse Gas Reporting Program (GHGRP) for the electricity sector. "]
["Use the Existing Specified Sources table to register sources already in our database (see \"Facilities Look Up\" tab) by selecting a facility from the drop-down list. "]
["For any source that you anticipate reporting that is not on the \"Facilities Look Up\" tab, add it in the New Specified Sources table."]
["For new sources that the reporting entity owns, complete as many fields as possible in the New Specified Sources table. For new specified sources that are not owned by the reporting entity, complete the source ID fields, where available."]
[]
["Existing Specified Sources Table Notes",null,null,null,null,null,"New Specified Sources Table Notes"]
["Note: Facility drop-down list is in alphabetical order.",null,null,null,null,null,"Note: Provide source IDs, where available. An Oregon ID will be assigned during registration. Information provided will be used to match the facility to a public data source, where available, to calculate facility-specific emission factors."]
["Note: Energy Imbalance Market is a source option in the drop-down list. "]
["Note: DEQ's Facilities database is derived from 2019 GHGRP reports to DEQ. The list may be incomplete due to change in reporting methodology.",null,null,null,null,null,"Note: Net Generation and Emissions refers to total facility or unit generation, regardless of whether the electricity was served to end-users in Oregon."]
[null,null,null,null,null,null,"Note: Emissions refers to anthropogenic CO2, CH4, and N2O expressed as MTCO2e."]
[]
["Existing Specified Sources","Source IDs",null,null,null,null,"New Specified Sources","Source IDs"]
[" (Select facility name from drop-down list. List refers to the \"Facilities Look Up\" tab)","Oregon DEQ ID","California Air Resources Board            (CARB) ID","Environmental Protection Agency                    (US EPA) ID","Energy Information Administration (US EIA) ID",null,"(Add sources NOT listed on the \"Facilities Look Up\" tab)","Do you own this facility or unit?","California Air Resources Board            (CARB) ID","Environmental Protection Agency                    (US EPA) ID","Energy Information Administration (US EIA) ID","Primary Fuel Type","Net Generation (MWh) for 2019","Emissions (MT CO2e) ","Data source for net generation","Data source for emissions","Comments (optional)"]
[null,{"$f":"_xlfn.IFNA(VLOOKUP(A15,'Facilities Look Up'!$A$3:$E$325,2,FALSE),\"\")","v":""},{"$f":"_xlfn.IFNA(VLOOKUP(A15,'Facilities Look Up'!$A$3:$E$325,3,FALSE),\"\")","v":""},{"$f":"_xlfn.IFNA(VLOOKUP(A15,'Facilities Look Up'!$A$3:$E$325,4,FALSE),\"\")","v":""},{"$f":"_xlfn.IFNA(VLOOKUP(A15,'Facilities Look Up'!$A$3:$E$325,5,FALSE),\"\")","v":""}]
[null,{"$f":"_xlfn.IFNA(VLOOKUP(A16,'Facilities Look Up'!$A$3:$E$325,2,FALSE),\"\")","v":""},{"$f":"_xlfn.IFNA(VLOOKUP(A16,'Facilities Look Up'!$A$3:$E$325,3,FALSE),\"\")","v":""},{"$f":"_xlfn.IFNA(VLOOKUP(A16,'Facilities Look Up'!$A$3:$E$325,4,FALSE),\"\")","v":""},{"$f":"_xlfn.IFNA(VLOOKUP(A16,'Facilities Look Up'!$A$3:$E$325,5,FALSE),\"\")","v":""}]
[null,{"$f":"_xlfn.IFNA(VLOOKUP(A17,'Facilities Look Up'!$A$3:$E$325,2,FALSE),\"\")","v":""},{"$f":"_xlfn.IFNA(VLOOKUP(A17,'Facilities Look Up'!$A$3:$E$325,3,FALSE),\"\")","v":""},{"$f":"_xlfn.IFNA(VLOOKUP(A17,'Facilities Look Up'!$A$3:$E$325,4,FALSE),\"\")","v":""},{"$f":"_xlfn.IFNA(VLOOKUP(A17,'Facilities Look Up'!$A$3:$E$325,5,FALSE),\"\")","v":""}]
[null,{"$f":"_xlfn.IFNA(VLOOKUP(A18,'Facilities Look Up'!$A$3:$E$325,2,FALSE),\"\")","v":""},{"$f":"_xlfn.IFNA(VLOOKUP(A18,'Facilities Look Up'!$A$3:$E$325,3,FALSE),\"\")","v":""},{"$f":"_xlfn.IFNA(VLOOKUP(A18,'Facilities Look Up'!$A$3:$E$325,4,FALSE),\"\")","v":""},{"$f":"_xlfn.IFNA(VLOOKUP(A18,'Facilities Look Up'!$A$3:$E$325,5,FALSE),\"\")","v":""}]
[null,{"$f":"_xlfn.IFNA(VLOOKUP(A19,'Facilities Look Up'!$A$3:$E$325,2,FALSE),\"\")","v":""},{"$f":"_xlfn.IFNA(VLOOKUP(A19,'Facilities Look Up'!$A$3:$E$325,3,FALSE),\"\")","v":""},{"$f":"_xlfn.IFNA(VLOOKUP(A19,'Facilities Look Up'!$A$3:$E$325,4,FALSE),\"\")","v":""},{"$f":"_xlfn.IFNA(VLOOKUP(A19,'Facilities Look Up'!$A$3:$E$325,5,FALSE),\"\")","v":""}]
[null,{"$f":"_xlfn.IFNA(VLOOKUP(A20,'Facilities Look Up'!$A$3:$E$325,2,FALSE),\"\")","v":""},{"$f":"_xlfn.IFNA(VLOOKUP(A20,'Facilities Look Up'!$A$3:$E$325,3,FALSE),\"\")","v":""},{"$f":"_xlfn.IFNA(VLOOKUP(A20,'Facilities Look Up'!$A$3:$E$325,4,FALSE),\"\")","v":""},{"$f":"_xlfn.IFNA(VLOOKUP(A20,'Facilities Look Up'!$A$3:$E$325,5,FALSE),\"\")","v":""}]
{"$rows_left_out":293}
{"sheet":"Historical Facilities Look Up","index":3,"n_rows":854,"n_cols":30,"rows_kept":854,"cut":false,"hidden":true,"merged":[[0,2,0,5],[0,0,0,1]]}
["Historical Reported Specified Sources",null,"Source IDs"]
["Data Source","Facility Name","Oregon ID","CARB ID","US EPA ID","EIA ID","Net Generation","Primary Fuel","Address line 1","Address Line 2","City","Zip","County","State","Country","Phone","Fax","Email address","Comments","Anthro EF 2015","Anthro EF 2016","Anthro EF 2017","Anthro EF 2018","Anthro EF 2019","Bio EF 2015","Bio EF 2016","Bio EF 2017","Bio EF 2018","Bio EF 2019","Mary Notes"]
["CARB Non-historical","San Emidio Project",null,400002,null,57456,64436,"Geothermal (Closed System)","PO Box 135",null,"Gerlach",89412,"Washoe","NV","USA",null,null,null,null,null,null,null,null,6.8658370786516806E-2]
["CARB Non-historical","Nine Mile HED",null,500001,null,3869,143308,"Hydro","W. 9602 Old Charles Road",null,"Nine Mile",99026,"Spokane","WA","USA",null,null,null,null,null,null,null,null,0]
["CARB Non-historical","Monroe Street HED",null,500002,null,9095,81033,"Hydro","311 N. Post Street",null,"Spokane",99201,"Spokane","WA","USA",null,null,null,null,null,null,null,null,0]
["CARB Non-historical","Mid-C Hydro - Rock Island (Chelan County PUD)",null,500003,null,null,null,"Hydro","Rock Island Dam",null,"Wenatchee",98801,"Chelan","WA","USA",null,null,null,null,null,null,null,null,0]
["CARB Non-historical","Glen Canyon Dam",null,500007,null,153,3958503,"Hydro","N/A",null,"Page",86040,"Coconino","AZ","USA",null,null,null,null,null,null,null,null,0]
["CARB Non-historical","Brownlee",null,500010,null,811,2418886,"Hydro","ID Highway #71 @ the Snake R.",null,"Cambridge",83610,"Washington","ID","USA",null,null,null,null,null,null,null,null,0]
["CARB Non-historical","Cabinet Gorge",null,500011,null,833,1159246,"Hydro","61940 Hwy 200",null,"Clark Fork",83811,"Bonner","ID","USA",null,null,null,null,null,null,null,null,0]
["CARB Non-historical","Kerr",null,500014,null,2188,975718,"Hydro","7000 Kerr Dam Road",null,"Polson",59860,"Lake","MT","USA",null,null,null,null,null,null,null,null,0]
["CARB Non-historical","Thompson Falls Dam",null,500015,null,2195,460628,"Hydro","1610 Maiden Lane",null,"Thompson Falls",59873,"Sanders","MT","USA",null,null,null,null,null,null,null,null,0]
["CARB Non-historical","Noxon Rapids",null,500016,null,2199,1840622,"Hydro","84 Avista Power Road",null,"Noxon",59853,"Sanders","MT","USA",null,null,null,null,null,null,null,null,0]
["CARB Non-historical","Hells Canyon",null,500019,null,3013,2194877,"Hydro","22 Miles N of OR Highway 86",null,"Oxbow",97840,"Wallowa","OR","USA",null,null,null,null,null,null,null,null,0]
["CARB Non-historical","Lower Baker",null,500025,null,3855,385262,"Hydro","46110 E Main St",null,"Concrete",98237,"Skagit","WA","USA",null,null,null,null,null,null,null,null,0]
["CARB Non-historical","Upper Baker",null,500026,null,3861,333791,"Hydro","46110 E Main St",null,"Concrete",98237,"Whatcom","WA","USA",null,null,null,null,null,null,null,null,0]
["CARB Non-historical","Boundary Hydroelectric Units",null,500043,null,6433,4003841,"Hydro","1198 Boundary Dam Access Road",null,"Metaline",99152,"Pend Oreille","WA","USA",null,null,null,null,null,null,null,null,0]
["CARB Non-historical","Lucky Peak Power Plant Project",null,500046,null,10014,347570,"Hydro","9731 E Highway 21",null,"Boise",83716,"Ada","ID","USA",null,null,null,null,null,null,null,null,0]
["CARB Non-historical","Orchard Avenue 1 (Yakima-Tieton ID)",null,500047,null,50421,3086,"Hydro","12731 Orchard Ave",null,"Yakima",98908,"Yakima","WA","USA",null,null,null,null,null,null,null,null,0]
["CARB Non-historical","Oxbow (Oregon)",null,500059,null,3014,1090414,"Hydro","OR Highway 86 at the Snake R.",null,"Oxbow",97840,"Baker","OR","USA",null,null,null,null,null,null,null,null,0]
["CARB Non-historical","Post Falls Hydro",null,500061,null,835,72493,"Hydro","1091 W 4th Ave.",null,"Post Falls",83854,"Kootenai","ID","USA",null,null,null,null,null,null,null,null,0]
{"$rows_left_out":835}
{"sheet":"Facilities Look Up","index":4,"n_rows":325,"n_cols":5,"rows_kept":325,"cut":false,"hidden":false,"merged":[[0,1,0,4]]}
["2019 Reported Specified Sources","Source IDs"]
["Facility Name","Oregon DEQ ID","California Air Resources Board            (CARB) ID","Environmental Protection Agency                    (US EPA) ID","Energy Information Administration (US EIA) ID"]
["45 Mile Hydroelectric Project (EBD Hydro)","111583",501050,null,58455]
["Adams Solar Center","111256",710119,null,61496]
["Ashton","111567",500240,null,825]
["Ballard Hog Farms","113304",900563]
["Bear Creek Dam Hydro Turbine (City of Astoria)","111584",501056]
["Bear Creek Solar Center","111257",710122,null,61281]
["Beaver",111800,910100,1002488,8073]
["Bell Mountain Hydro (Pancheri)","111540",500202]
["Bell Mountain Power (Jake Amy)","111577",501003]
["Bend","111571",500246,null,6484]
["Bennett Mountain Power",111801,910101,1000244,55733]
["Beryl Solar Plant","111210",700106,null,58598]
["Big Fork","111570",500244,null,6459]
["Big Horn II-Wind",113000,800180]
["Big Horn PPM-Wind Power Project",113001,800177,null,56361]
["Big Top, LLC","111338",800157,null,56968]
["Biglow Canyon Wind Farm (Phase 3)",113002,810003,null,56485]
["Biomass One, L.P.","110201",900038,null,10869]
{"$rows_left_out":306}
{"sheet":"EPEs","index":5,"n_rows":147,"n_cols":4,"rows_kept":147,"cut":false,"hidden":true,"merged":[]}
["ARB ID","EPE Name","EDU Type (CTR)","EPE Type All"]
[3006,"3 Phases Renewables - EPE",null,"ESP"]
[104659,"Agera Energy LLC - RSO",null,"ESP"]
[3022,"Alameda Municipal Power - RSO","POU","POU"]
[104727,"American PowerNet Management, LP - RSO",null,"ESP"]
[3023,"Anaheim, City of PUD - EPE","POU","POU"]
[104578,"Anza Electric Cooperative - RSO","COOP","Co-op"]
[104725,"Apple Valley Choice Energy - RSO",null,"CCA"]
[2098,"Arizona Electric Power Cooperative (AEPCo) - EPE",null,"Marketer"]
[104131,"Arizona Public Service Company (APS) - EPE",null,"Marketer"]
[2292,"Avangrid Renewables - EPE",null,"Marketer"]
[104677,"Avista Utilities - EPE",null,"Marketer"]
[3024,"Azusa Light & Water - EPE","POU","POU"]
[3025,"Banning, City of Electric Department - EPE","POU","POU"]
[3000,"Bear Valley Electric Service - RSO","IOU","IOU"]
[3026,"Biggs Municipal Utilities - RSO","POU","POU"]
[4000,"Bonneville Power Administration (BPA) - ACS",null,"ACS"]
[2044,"Bonneville Power Administration (BPA) - EPE",null,"Marketer"]
[104692,"Boston Energy Trading & Marketing - EPE",null,"Marketer"]
[2113,"BP Energy Company - EPE",null,"Marketer"]
{"$rows_left_out":127}