{"text_format":"1","workbook":"xlsx","n_sheets":8,"sheets":["Instructions","Claim Entry Example","Claim Totals Example","Claim Entry","Claim Totals","sponsor dropdowns","BATB Reqd","Subgrants"],"not_rendered":{"charts":0,"images":0,"macros":1,"external_links":0,"defined_names":19,"comments":2,"pivot_tables":0},"unopened":[],"bounds":{"document_bytes":16777216,"sheet_cells":100000,"rows_first":2000,"rows_last":500,"rows_between":2000,"halvings":0,"cell_chars":16384,"cell_head_chars":4096},"cells_cut":0,"cells_raw":0,"read":"whole","date_system":"1900"}

{"sheet":"Instructions","index":0,"n_rows":27,"n_cols":3,"rows_kept":27,"cut":false,"hidden":false,"merged":[]}
[]
[null,"Instructions for Completing BAtB Equipment Grant Claim Form"]
[null,null,"This claim form has replaced the previous Word document claim form.  The purpose of the form is to provided for a more efficient and accurate claim reporting, better tracking tool, and less cumbersome submissions. "]
[null,"CLAIM ENTRY EXAMPLE AND CLAIM TOTALS EXAMPLE TABS"]
[null,null,"Please review these tabs as a guide for entering information into the \"claim entry\" tab. Do not enter your invoice and claim information on these tabs. "]
[null,"CLAIM ENTRY TAB"]
[null,1,"Columns I-K, Row 2 - Sponsor Name: Click on the “drop down” button to select your sponsor’s name.  Once this is selected, a list of your BAtB sites will be displayed in blue.  If you see an additional site or a site that is missing, please contact ode.schoolnutrition@ode.oregon.gov indicating the correction needed.   "]
[null,2,"Column G - Claim Date: This is the date that you will be submitting this document for ODE CNP approval.  It may be possible that you will use the same date on multiple rows for the different equipment on the invoice(s).  The spreadsheet will group the equipment costs per site by the identifying claim date.  "]
[null,3,"Columns H-K - Equipment/Invoice Information:  Using your invoice as a reference, enter the vendor, invoice number, invoice date, and each equipment item.  If you have multiple items, you can copy and paste the claim date, vendor, invoice number, and invoice date to several rows.  If you don’t have some of this information, you may leave some cells blank.  "]
[null,4,"Column L - Reason:  Please use the drop down to indicate how this product will be used for Breakfast After the Bell.  If one of the reasons from the drop-down doesn’t apply, you can enter your own reason in the blank cell."]
[null,5,"Column M and after - Enter the equipment amount for each site.  If you purchased multiple pieces of the same equipment item, you can enter this on same row for the equipment and then the cost of each piece under each site.  If you purchased one piece of equipment that will be used for multiple sites, you can enter the amount you want applied to each site.  The total amount on the form cannot be more than the piece of equipment shown on the invoice."]
[null,6,"After the first claim has been submitted and processed,  you may want to purchase additional equipment and submit another claim.   You can enter your information in the next row.  Again, please don’t forget to enter the same date for each claim submitted for approval"]
[null,null,"CNP Use Only"]
[null,null,"The “CNP Use Only” is a hidden section, You can view this by clicking on the +(plus)  button from the left top bar.  (Click)  Please do not make any edits to this section.  This is for viewing only to check the claims that have been approved, processed through EGMS and to check if any corrections are needed. "]
[null,"CLAIM TOTALS TAB"]
{"$rows_left_out":13}
{"sheet":"Claim Entry Example","index":1,"n_rows":54,"n_cols":15,"rows_kept":54,"cut":false,"hidden":false,"merged":[[1,8,1,10]]}
[]
[null,null,null,null,null,null,null,"Sponsor Name","Wild Things Unified School District"]
["CNP USE ONLY",null,null,null,null,null,null,null,null,null,null,null,{"$f":"IF(\n    OR('Claim Entry Example'!I2=\"\",'Claim Entry Example'!I2=\"Select Sponsor\"),\n    \"\",\n    TRANSPOSE(_xlfn.UNIQUE(_xlfn._xlws.FILTER('sponsor dropdowns'!J:K,'sponsor dropdowns'!I:I='Claim Entry Example'!I2)))\n)","v":90001},90002,90003]
["Comments","TOTAL","Total Claim Amount","ODE Approved","Dated Processed in EGMS","Claim No.","Claim\nDate","Vendor","Invoice\nNumber","Invoice\nDate","Equipment Item","Reason\n(Select primary reason or enter your own)","Max's Island Elementary School","Rumpus Middle School","Crown & Scepter High School "]
[null,{"$f":"IFERROR(\n    _xlfn.LET(\n        _xlpm.spill,_xlfn.ANCHORARRAY( $M$3),\n        _xlpm.rowData, _xlfn.TAKE(_xlfn.DROP('Claim Entry Example'!5:5,,12), , COLUMNS(_xlpm.spill)),\n        SUM(_xlfn._xlws.FILTER(_xlpm.rowData, ISNUMBER(_xlpm.rowData)))\n    ),\n\"\")","v":94.679999999999993},{"$f":"SUMIFS($B$5:$B$54,F5:F54,F5:F54)","v":2969.5},"2025-10-12","2025-10-13",{"$f":"IF(G5=\"\",\"\",_xlfn.LET(_xlpm.d,$G$5:G5,COUNT(_xlfn.UNIQUE(_xlpm.d))))","v":1},"2025-10-09","Bargreen",1001,"2025-09-09","Can opener","Prepare or serve food",31.56,31.56,31.56]
[null,{"$f":"IFERROR(\n    _xlfn.LET(\n        _xlpm.spill,_xlfn.ANCHORARRAY( $M$3),\n        _xlpm.rowData, _xlfn.TAKE(_xlfn.DROP('Claim Entry Example'!6:6,,12), , COLUMNS(_xlpm.spill)),\n        SUM(_xlfn._xlws.FILTER(_xlpm.rowData, ISNUMBER(_xlpm.rowData)))\n    ),\n\"\")","v":17.73},2969.5,"2025-10-12","2025-10-13",{"$f":"IF(G6=\"\",\"\",_xlfn.LET(_xlpm.d,$G$5:G6,COUNT(_xlfn.UNIQUE(_xlpm.d))))","v":1},"2025-10-09","Bargreen",1001,"2025-09-09","Paring knife","Prepare or serve food",5.91,5.91,5.91]
[null,{"$f":"IFERROR(\n    _xlfn.LET(\n        _xlpm.spill,_xlfn.ANCHORARRAY( $M$3),\n        _xlpm.rowData, _xlfn.TAKE(_xlfn.DROP('Claim Entry Example'!7:7,,12), , COLUMNS(_xlpm.spill)),\n        SUM(_xlfn._xlws.FILTER(_xlpm.rowData, ISNUMBER(_xlpm.rowData)))\n    ),\n\"\")","v":879.30000000000007},2969.5,"2025-10-12","2025-10-13",{"$f":"IF(G7=\"\",\"\",_xlfn.LET(_xlpm.d,$G$5:G7,COUNT(_xlfn.UNIQUE(_xlpm.d))))","v":1},"2025-10-09","Bargreen",1001,"2025-09-09","Market Trays","Prepare or serve food",293.10000000000002,293.10000000000002,293.10000000000002]
[null,{"$f":"IFERROR(\n    _xlfn.LET(\n        _xlpm.spill,_xlfn.ANCHORARRAY( $M$3),\n        _xlpm.rowData, _xlfn.TAKE(_xlfn.DROP('Claim Entry Example'!8:8,,12), , COLUMNS(_xlpm.spill)),\n        SUM(_xlfn._xlws.FILTER(_xlpm.rowData, ISNUMBER(_xlpm.rowData)))\n    ),\n\"\")","v":1977.79},2969.5,"2025-10-12","2025-10-13",{"$f":"IF(G8=\"\",\"\",_xlfn.LET(_xlpm.d,$G$5:G8,COUNT(_xlfn.UNIQUE(_xlpm.d))))","v":1},"2025-10-09","Amazon",888,"09/20.25","Small Wares","Prepare or serve food",643.33000000000004,650.42999999999995,684.03]
[null,{"$f":"IFERROR(\n    _xlfn.LET(\n        _xlpm.spill,_xlfn.ANCHORARRAY( $M$3),\n        _xlpm.rowData, _xlfn.TAKE(_xlfn.DROP('Claim Entry Example'!9:9,,12), , COLUMNS(_xlpm.spill)),\n        SUM(_xlfn._xlws.FILTER(_xlpm.rowData, ISNUMBER(_xlpm.rowData)))\n    ),\n\"\")","v":299.99},317.72000000000003,"2025-11-03","2025-11-04",{"$f":"IF(G9=\"\",\"\",_xlfn.LET(_xlpm.d,$G$5:G9,COUNT(_xlfn.UNIQUE(_xlpm.d))))","v":2},"2025-10-31","Webstore",999,"2025-10-01","Immersion Hand Mixer ","Prepare or serve food",78.33,78.33,143.33000000000001]
[null,{"$f":"IFERROR(\n    _xlfn.LET(\n        _xlpm.spill,_xlfn.ANCHORARRAY( $M$3),\n        _xlpm.rowData, _xlfn.TAKE(_xlfn.DROP('Claim Entry Example'!10:10,,12), , COLUMNS(_xlpm.spill)),\n        SUM(_xlfn._xlws.FILTER(_xlpm.rowData, ISNUMBER(_xlpm.rowData)))\n    ),\n\"\")","v":17.73},317.72000000000003,"2025-11-03","2025-11-04",{"$f":"IF(G10=\"\",\"\",_xlfn.LET(_xlpm.d,$G$5:G10,COUNT(_xlfn.UNIQUE(_xlpm.d))))","v":2},"2025-10-31","Webstore",999,"2025-10-01","Paring knife","Prepare or serve food",5.91,5.91,5.91]
[null,{"$f":"IFERROR(\n    _xlfn.LET(\n        _xlpm.spill,_xlfn.ANCHORARRAY( $M$3),\n        _xlpm.rowData, _xlfn.TAKE(_xlfn.DROP('Claim Entry Example'!11:11,,12), , COLUMNS(_xlpm.spill)),\n        SUM(_xlfn._xlws.FILTER(_xlpm.rowData, ISNUMBER(_xlpm.rowData)))\n    ),\n\"\")","v":879.30000000000007},2249.89,"2025-11-17","2025-11-17",{"$f":"IF(G11=\"\",\"\",_xlfn.LET(_xlpm.d,$G$5:G11,COUNT(_xlfn.UNIQUE(_xlpm.d))))","v":3},"2025-11-15","Webstore",999,"2025-11-01","Market Trays","Prepare or serve food",293.10000000000002,293.10000000000002,293.10000000000002]
[null,{"$f":"IFERROR(\n    _xlfn.LET(\n        _xlpm.spill,_xlfn.ANCHORARRAY( $M$3),\n        _xlpm.rowData, _xlfn.TAKE(_xlfn.DROP('Claim Entry Example'!12:12,,12), , COLUMNS(_xlpm.spill)),\n        SUM(_xlfn._xlws.FILTER(_xlpm.rowData, ISNUMBER(_xlpm.rowData)))\n    ),\n\"\")","v":100},2249.89,"2025-11-17","2025-11-17",{"$f":"IF(G12=\"\",\"\",_xlfn.LET(_xlpm.d,$G$5:G12,COUNT(_xlfn.UNIQUE(_xlpm.d))))","v":3},"2025-11-15","Webstore",999,"2025-11-01","Salad Bar Legs","Transporting food to service area",0,100,0]
["Over claim amount - sent back for corrections",{"$f":"IFERROR(\n    _xlfn.LET(\n        _xlpm.spill,_xlfn.ANCHORARRAY( $M$3),\n        _xlpm.rowData, _xlfn.TAKE(_xlfn.DROP('Claim Entry Example'!13:13,,12), , COLUMNS(_xlpm.spill)),\n        SUM(_xlfn._xlws.FILTER(_xlpm.rowData, ISNUMBER(_xlpm.rowData)))\n    ),\n\"\")","v":1270.5899999999999},2249.89,"2025-11-17","2025-11-17",{"$f":"IF(G13=\"\",\"\",_xlfn.LET(_xlpm.d,$G$5:G13,COUNT(_xlfn.UNIQUE(_xlpm.d))))","v":3},"2025-11-15","Webstaurant",1000,"2025-11-03","Breakfast Cart","Transporting food to service area",1270.5899999999999,0,0]
[null,{"$f":"IFERROR(\n    _xlfn.LET(\n        _xlpm.spill,_xlfn.ANCHORARRAY( $M$3),\n        _xlpm.rowData, _xlfn.TAKE(_xlfn.DROP('Claim Entry Example'!14:14,,12), , COLUMNS(_xlpm.spill)),\n        SUM(_xlfn._xlws.FILTER(_xlpm.rowData, ISNUMBER(_xlpm.rowData)))\n    ),\n\"\")","v":""},0,null,null,{"$f":"IF(G14=\"\",\"\",_xlfn.LET(_xlpm.d,$G$5:G14,COUNT(_xlfn.UNIQUE(_xlpm.d))))","v":""}]
[null,{"$f":"IFERROR(\n    _xlfn.LET(\n        _xlpm.spill,_xlfn.ANCHORARRAY( $M$3),\n        _xlpm.rowData, _xlfn.TAKE(_xlfn.DROP('Claim Entry Example'!15:15,,12), , COLUMNS(_xlpm.spill)),\n        SUM(_xlfn._xlws.FILTER(_xlpm.rowData, ISNUMBER(_xlpm.rowData)))\n    ),\n\"\")","v":""},0,null,null,{"$f":"IF(G15=\"\",\"\",_xlfn.LET(_xlpm.d,$G$5:G15,COUNT(_xlfn.UNIQUE(_xlpm.d))))","v":""}]
{"$rows_left_out":40}
{"sheet":"Claim Totals Example","index":2,"n_rows":11,"n_cols":6,"rows_kept":11,"cut":false,"hidden":false,"merged":[]}
[]
[null,null,"Summary of Totals from 'Claim Entry Example' Sheet"]
[]
[null,null,null,{"$f":"INDEX(_xlfn.ANCHORARRAY('Claim Entry Example'!M3), 2, 0)","v":"Max's Island Elementary School"},"Rumpus Middle School","Crown & Scepter High School "]
[null,null,"Subgrant Number",{"$f":"IF(_xlfn.ANCHORARRAY(D4)=\"\",\"\",_xlfn.XLOOKUP(_xlfn.ANCHORARRAY(D4),'sponsor dropdowns'!$K$2:$K$44,'sponsor dropdowns'!$L$2:$L$44))","v":"SG-90001-ME"},"SG-90002-RM","SG-90003-CS"]
[null,null,"Amount Allocated for SY 25-26",{"$f":"IF(_xlfn.ANCHORARRAY(D5)=\"\",\"\",2023)","v":2023},2023,2023]
[null,null,"Remaining Amount Available",{"$f":"_xlfn.ANCHORARRAY(D6)-_xlfn.ANCHORARRAY(D8)","v":-598.82999999999993},564.65999999999985,566.05999999999995]
["Claim\nNo.","Claim\nDate","Totals by Site ⇒\n& by Claim No. ⇓",{"$f":"_xlfn.BYCOL(_xlfn.ANCHORARRAY(D9), _xlfn.LAMBDA(_xlpm.c, SUM(_xlpm.c)))","v":2621.83},1458.3400000000001,1456.94]
[{"$f":"_xlfn.UNIQUE(_xlfn._xlws.FILTER('Claim Entry Example'!F5:F54, 'Claim Entry Example'!F5:F54<>\"\"))","v":1},{"$f":"_xlfn.XLOOKUP(_xlfn.ANCHORARRAY(A9),'Claim Entry Example'!$F$5:$F$54,'Claim Entry Example'!$G$5:$G$54)","v":"2025-10-09"},{"$f":"_xlfn.BYROW(_xlfn.ANCHORARRAY(D9), _xlfn.LAMBDA(_xlpm.r, SUM(_xlpm.r)))","v":2969.5},{"$f":"_xlfn.MAKEARRAY(\n    ROWS(_xlfn.ANCHORARRAY('Claim Totals Example'!B9)),\n    COLUMNS(INDEX(_xlfn.ANCHORARRAY('Claim Entry Example'!M3), 2, 0)),\n    _xlfn.LAMBDA(_xlpm.r,_xlpm.c,\n        SUMPRODUCT(\n            ('Claim Entry Example'!G5:G104 = INDEX(_xlfn.ANCHORARRAY('Claim Totals Example'!B9), _xlpm.r)) *\n            OFFSET('Claim Entry Example'!M5, 0, _xlpm.c-1, ROWS('Claim Entry Example'!G5:G104), 1)\n        )\n    )\n)","v":973.90000000000009},981,1014.6]
[2,"2025-10-31",317.72000000000003,84.24,84.24,149.24]
[3,"2025-11-15",2249.89,1563.69,393.1,293.10000000000002]

{"sheet":"Claim Entry","index":3,"n_rows":54,"n_cols":13,"rows_kept":54,"cut":false,"hidden":false,"merged":[[1,8,1,10]]}
[]
[null,null,null,null,null,null,null,"Sponsor Name","Select Sponsor",null,null,null,{"$f":"IF(\n    OR(Sponsor_Name = \"\", Sponsor_Name = \"Select Sponsor\"),\n    \"\",\n    TRANSPOSE(_xlfn.CHOOSECOLS(_xlfn._xlws.FILTER('BATB Reqd'!A:G,'BATB Reqd'!B:B = Sponsor_Name), 3, 7, 4))\n)","v":""}]
["CNP USE ONLY"]
["Comments","TOTAL","Total Claim Amount","ODE Approved","Dated Processed in EGMS","Claim No.","Claim\nDate","Vendor","Invoice\nNumber","Invoice\nDate","Equipment Item","Reason\n(Select primary reason or enter your own)"]
[null,{"$f":"IFERROR(\n    _xlfn.LET(\n        _xlpm.spill,_xlfn.ANCHORARRAY( $M$2),\n        _xlpm.rowData, _xlfn.TAKE(_xlfn.DROP('Claim Entry'!5:5,,12), , COLUMNS(_xlpm.spill)),\n        SUM(_xlfn._xlws.FILTER(_xlpm.rowData, ISNUMBER(_xlpm.rowData)))\n    ),\n\"\")","v":""},{"$f":"SUMIFS($B$5:$B$54,F5:F54,F5:F54)","v":0},null,null,{"$f":"IF(G5=\"\",\"\",_xlfn.LET(_xlpm.d,$G$5:G5,COUNT(_xlfn.UNIQUE(_xlpm.d))))","v":""}]
[null,{"$f":"IFERROR(\n    _xlfn.LET(\n        _xlpm.spill,_xlfn.ANCHORARRAY( $M$2),\n        _xlpm.rowData, _xlfn.TAKE(_xlfn.DROP('Claim Entry'!6:6,,12), , COLUMNS(_xlpm.spill)),\n        SUM(_xlfn._xlws.FILTER(_xlpm.rowData, ISNUMBER(_xlpm.rowData)))\n    ),\n\"\")","v":""},0,null,null,{"$f":"IF(G6=\"\",\"\",_xlfn.LET(_xlpm.d,$G$5:G6,COUNT(_xlfn.UNIQUE(_xlpm.d))))","v":""}]
[null,{"$f":"IFERROR(\n    _xlfn.LET(\n        _xlpm.spill,_xlfn.ANCHORARRAY( $M$2),\n        _xlpm.rowData, _xlfn.TAKE(_xlfn.DROP('Claim Entry'!7:7,,12), , COLUMNS(_xlpm.spill)),\n        SUM(_xlfn._xlws.FILTER(_xlpm.rowData, ISNUMBER(_xlpm.rowData)))\n    ),\n\"\")","v":""},0,null,null,{"$f":"IF(G7=\"\",\"\",_xlfn.LET(_xlpm.d,$G$5:G7,COUNT(_xlfn.UNIQUE(_xlpm.d))))","v":""}]
[null,{"$f":"IFERROR(\n    _xlfn.LET(\n        _xlpm.spill,_xlfn.ANCHORARRAY( $M$2),\n        _xlpm.rowData, _xlfn.TAKE(_xlfn.DROP('Claim Entry'!8:8,,12), , COLUMNS(_xlpm.spill)),\n        SUM(_xlfn._xlws.FILTER(_xlpm.rowData, ISNUMBER(_xlpm.rowData)))\n    ),\n\"\")","v":""},0,null,null,{"$f":"IF(G8=\"\",\"\",_xlfn.LET(_xlpm.d,$G$5:G8,COUNT(_xlfn.UNIQUE(_xlpm.d))))","v":""}]
[null,{"$f":"IFERROR(\n    _xlfn.LET(\n        _xlpm.spill,_xlfn.ANCHORARRAY( $M$2),\n        _xlpm.rowData, _xlfn.TAKE(_xlfn.DROP('Claim Entry'!9:9,,12), , COLUMNS(_xlpm.spill)),\n        SUM(_xlfn._xlws.FILTER(_xlpm.rowData, ISNUMBER(_xlpm.rowData)))\n    ),\n\"\")","v":""},0,null,null,{"$f":"IF(G9=\"\",\"\",_xlfn.LET(_xlpm.d,$G$5:G9,COUNT(_xlfn.UNIQUE(_xlpm.d))))","v":""}]
[null,{"$f":"IFERROR(\n    _xlfn.LET(\n        _xlpm.spill,_xlfn.ANCHORARRAY( $M$2),\n        _xlpm.rowData, _xlfn.TAKE(_xlfn.DROP('Claim Entry'!10:10,,12), , COLUMNS(_xlpm.spill)),\n        SUM(_xlfn._xlws.FILTER(_xlpm.rowData, ISNUMBER(_xlpm.rowData)))\n    ),\n\"\")","v":""},0,null,null,{"$f":"IF(G10=\"\",\"\",_xlfn.LET(_xlpm.d,$G$5:G10,COUNT(_xlfn.UNIQUE(_xlpm.d))))","v":""}]
[null,{"$f":"IFERROR(\n    _xlfn.LET(\n        _xlpm.spill,_xlfn.ANCHORARRAY( $M$2),\n        _xlpm.rowData, _xlfn.TAKE(_xlfn.DROP('Claim Entry'!11:11,,12), , COLUMNS(_xlpm.spill)),\n        SUM(_xlfn._xlws.FILTER(_xlpm.rowData, ISNUMBER(_xlpm.rowData)))\n    ),\n\"\")","v":""},0,null,null,{"$f":"IF(G11=\"\",\"\",_xlfn.LET(_xlpm.d,$G$5:G11,COUNT(_xlfn.UNIQUE(_xlpm.d))))","v":""}]
[null,{"$f":"IFERROR(\n    _xlfn.LET(\n        _xlpm.spill,_xlfn.ANCHORARRAY( $M$2),\n        _xlpm.rowData, _xlfn.TAKE(_xlfn.DROP('Claim Entry'!12:12,,12), , COLUMNS(_xlpm.spill)),\n        SUM(_xlfn._xlws.FILTER(_xlpm.rowData, ISNUMBER(_xlpm.rowData)))\n    ),\n\"\")","v":""},0,null,null,{"$f":"IF(G12=\"\",\"\",_xlfn.LET(_xlpm.d,$G$5:G12,COUNT(_xlfn.UNIQUE(_xlpm.d))))","v":""}]
[null,{"$f":"IFERROR(\n    _xlfn.LET(\n        _xlpm.spill,_xlfn.ANCHORARRAY( $M$2),\n        _xlpm.rowData, _xlfn.TAKE(_xlfn.DROP('Claim Entry'!13:13,,12), , COLUMNS(_xlpm.spill)),\n        SUM(_xlfn._xlws.FILTER(_xlpm.rowData, ISNUMBER(_xlpm.rowData)))\n    ),\n\"\")","v":""},0,null,null,{"$f":"IF(G13=\"\",\"\",_xlfn.LET(_xlpm.d,$G$5:G13,COUNT(_xlfn.UNIQUE(_xlpm.d))))","v":""}]
[null,{"$f":"IFERROR(\n    _xlfn.LET(\n        _xlpm.spill,_xlfn.ANCHORARRAY( $M$2),\n        _xlpm.rowData, _xlfn.TAKE(_xlfn.DROP('Claim Entry'!14:14,,12), , COLUMNS(_xlpm.spill)),\n        SUM(_xlfn._xlws.FILTER(_xlpm.rowData, ISNUMBER(_xlpm.rowData)))\n    ),\n\"\")","v":""},0,null,null,{"$f":"IF(G14=\"\",\"\",_xlfn.LET(_xlpm.d,$G$5:G14,COUNT(_xlfn.UNIQUE(_xlpm.d))))","v":""}]
[null,{"$f":"IFERROR(\n    _xlfn.LET(\n        _xlpm.spill,_xlfn.ANCHORARRAY( $M$2),\n        _xlpm.rowData, _xlfn.TAKE(_xlfn.DROP('Claim Entry'!15:15,,12), , COLUMNS(_xlpm.spill)),\n        SUM(_xlfn._xlws.FILTER(_xlpm.rowData, ISNUMBER(_xlpm.rowData)))\n    ),\n\"\")","v":""},0,null,null,{"$f":"IF(G15=\"\",\"\",_xlfn.LET(_xlpm.d,$G$5:G15,COUNT(_xlfn.UNIQUE(_xlpm.d))))","v":""}]
{"$rows_left_out":40}
{"sheet":"Claim Totals","index":4,"n_rows":9,"n_cols":4,"rows_kept":9,"cut":false,"hidden":false,"merged":[]}
[]
[null,null,"Summary of Totals from 'Claim Entry' Sheet"]
[]
[null,null,null,{"$f":"INDEX(_xlfn.ANCHORARRAY('Claim Entry'!M2), 3, 0)","v":{"$error":"#REF!"}}]
[null,null,"Subgrant Number",{"$f":"INDEX(_xlfn.ANCHORARRAY('Claim Entry'!M2), 2, 0)","v":{"$error":"#REF!"}}]
[null,null,"Amount Allocated for SY 25-26",{"$f":"IF(_xlfn.ANCHORARRAY(D4)=\"\",\"\",2023)","v":{"$error":"#REF!"}}]
[null,null,"Remaining Amount Available",{"$f":"_xlfn.ANCHORARRAY(D6)-_xlfn.ANCHORARRAY(D8)","v":{"$error":"#REF!"}}]
["Claim\nNo.","Claim\nDate","Totals by Site ⇒\n& by Claim No. ⇓",{"$f":"_xlfn.BYCOL(_xlfn.ANCHORARRAY(D9), _xlfn.LAMBDA(_xlpm.c, SUM(_xlpm.c)))","v":{"$error":"#REF!"}}]
[{"$f":"_xlfn.UNIQUE(_xlfn._xlws.FILTER('Claim Entry'!F5:F54, 'Claim Entry'!F5:F54<>\"\"))","v":{"$error":"#VALUE!"}},{"$f":"_xlfn.XLOOKUP(_xlfn.ANCHORARRAY(A9),'Claim Entry'!$F$5:$F$104,'Claim Entry'!$G$5:$G$104)","v":{"$error":"#VALUE!"}},{"$f":"_xlfn.BYROW(_xlfn.ANCHORARRAY(D9), _xlfn.LAMBDA(_xlpm.r, SUM(_xlpm.r)))","v":{"$error":"#REF!"}},{"$f":"_xlfn.MAKEARRAY(\n    ROWS(_xlfn.ANCHORARRAY('Claim Totals'!B9)),\n    COLUMNS(INDEX(_xlfn.ANCHORARRAY('Claim Entry'!M2), 3, 0)),\n    _xlfn.LAMBDA(_xlpm.r,_xlpm.c,\n        SUMPRODUCT(\n            ('Claim Entry'!G5:G104 = INDEX(_xlfn.ANCHORARRAY('Claim Totals'!B9), _xlpm.r)) *\n            OFFSET('Claim Entry'!M5, 0, _xlpm.c-1, ROWS('Claim Entry'!G5:G104), 1)\n        )\n    )\n)","v":{"$error":"#REF!"}}]

{"sheet":"sponsor dropdowns","index":5,"n_rows":111,"n_cols":12,"rows_kept":111,"cut":false,"hidden":true,"merged":[]}
["Select Sponsor",null,"Site Num","Sites","Subgrant No.",null,"Reasons",null,"Select Sponsor","Site Num","Sites","Subgrant No."]
["Alsea SD 7J",null,{"$f":"IF(\n  OR(Sponsor_Name = \"\", Sponsor_Name = \"Select Sponsor\"),\n  \"\",\n  _xlfn.CHOOSECOLS(_xlfn._xlws.FILTER('BATB Reqd'!A:G,'BATB Reqd'!B:B = Sponsor_Name), 3, 4, 7)\n)","v":""},null,null,null,"Advertisement and promotion",null,"Wild Things Unified School District",90001,"Max's Island Elementary School","SG-90001-ME"]
["Astoria SD",null,null,null,null,null,"Create more appealing, nutritious offerings for students",null,"Wild Things Unified School District",90002,"Rumpus Middle School","SG-90002-RM"]
["Athena-Weston SD 29RJ",null,null,null,null,null,"Crowd Control",null,"Wild Things Unified School District",90003,"Crown & Scepter High School ","SG-90003-CS"]
["Baker SD 5J",null,null,null,null,null,"Efficient service lines"]
["Bend-LaPine SD",null,null,null,null,null,"Enhance breakfast after the bell serving area"]
["Bethel SD 52",null,null,null,null,null,"Improve efficiency of kitchen"]
["Brookings-Harbor SD 17C",null,null,null,null,null,"Maintain safe serving temperatures"]
["Butte Falls SD 91",null,null,null,null,null,"Organize food and supplies storage"]
["Cascade SD 5",null,null,null,null,null,"Prepare or serve food"]
["Centennial SD 28J",null,null,null,null,null,"Quicker wait time for students to receive a reimbursable meal"]
["Central Curry SD 1",null,null,null,null,null,"Racks for organization"]
["Central Point SD",null,null,null,null,null,"Sanitation or food safety"]
["Central SD 13J",null,null,null,null,null,"Serve grab and go and second chance breakfast models"]
["Clatskanie SD 6J",null,null,null,null,null,"Transporting food to service area"]
{"$rows_left_out":97}
{"sheet":"BATB Reqd","index":6,"n_rows":477,"n_cols":8,"rows_kept":477,"cut":false,"hidden":true,"merged":[]}
["Sponsor Number","Sponsor Name","Site Number","Site Name","BAtB Required","BAtB Exemption Eligible","Grant No.","Round"]
[201001,"Alsea SD 7J",15014,"Alsea Schools","Yes","","87790",1]
[401002,"Astoria SD",10010,"Astor Elementary","Yes","","87808",1]
[3001001,"Athena-Weston SD 29RJ",14206,"Athena Elementary","Yes","","87809",1]
[3001001,"Athena-Weston SD 29RJ",11116,"Weston Middle","Yes","","87810",1]
[102001,"Baker SD 5J",16662,"Baker Early Learning Center","Yes","Yes","87811",1]
[102001,"Baker SD 5J",10017,"Brooklyn Primary School","Yes","Yes","87812",1]
[102001,"Baker SD 5J",14855,"Eagle Cap","Yes","","87813",1]
[102001,"Baker SD 5J",16879,"Eastern Oregon Headstart  Baker Center","Yes","Yes","87814",1]
[102001,"Baker SD 5J",10022,"South Baker Elementary","Yes","","87815",1]
[902001,"Bend-LaPine SD",10036,"Bear Creek Elementary","Yes","","87867",1]
[902001,"Bend-LaPine SD",10038,"Elk Meadow Elementary","Yes","","87875",1]
[902001,"Bend-LaPine SD",13454,"Ensworth Elementary","Yes","","87876",1]
[902001,"Bend-LaPine SD",10042,"LaPine Elementary","Yes","","87877",1]
[902001,"Bend-LaPine SD",10028,"LaPine High School","Yes","","87878",1]
{"$rows_left_out":463}
{"sheet":"Subgrants","index":7,"n_rows":477,"n_cols":6,"rows_kept":477,"cut":false,"hidden":true,"merged":[]}
["Grant No.","SponsorNo.","School District/Sponsor/Fiscal Agent","School Site/Award Recipient","SiteId","Round"]
[87790,201001,"Alsea SD 7J","Alsea Schools",15014,1]
[87808,401002,"Astoria SD","Astor Elementary",10010,1]
[87809,3001001,"Athena-Weston SD 29RJ","Athena Elementary",14206,1]
[87810,3001001,"Athena-Weston SD 29RJ","Weston Middle",11116,1]
[87811,102001,"Baker SD 5J","Baker Early Learning Center",16662,1]
[87812,102001,"Baker SD 5J","Brooklyn Elementary",10017,1]
[87813,102001,"Baker SD 5J","Eagle Cap",14855,1]
[87814,102001,"Baker SD 5J","Eastern Oregon Headstart  Baker Center",16879,1]
[87815,102001,"Baker SD 5J","South Baker Elementary",10022,1]
[87867,902001,"Bend LaPine SD","Bear Creek Elementary",10036,1]
[87875,902001,"Bend LaPine SD","Elk Meadow Elementary",10038,1]
[87876,902001,"Bend LaPine SD","Ensworth Elementary",13454,1]
[87877,902001,"Bend LaPine SD","LaPine Elementary",10042,1]
[87878,902001,"Bend LaPine SD","LaPine High School ",10028,1]
{"$rows_left_out":462}