{"text_format":"1","workbook":"xlsx","n_sheets":15,"sheets":["Client Demographics","ADLs","Medical Needs","Nursing Assessment Indicators","Nighttime Needs","Behavior Needs","Foster Care Budget Summary","Host Home Budget Summary","Children Rate Information","Support Needs Summary","MFCU Use Only","Raw Scoring","New Scoring","HHRawScoring","HHScoring"],"not_rendered":{"charts":0,"images":22,"macros":1,"external_links":0,"defined_names":61,"comments":0,"pivot_tables":0},"unopened":[],"bounds":{"document_bytes":16777216,"sheet_cells":100000,"rows_first":2000,"rows_last":500,"rows_between":2000,"halvings":0,"cell_chars":16384,"cell_head_chars":4096},"cells_cut":0,"cells_raw":0,"read":"whole","date_system":"1900"}

{"sheet":"Client Demographics","index":0,"n_rows":26,"n_cols":15,"rows_kept":26,"cut":false,"hidden":false,"merged":[[11,13,11,16],[17,8,17,12],[13,13,13,15],[14,13,14,15],[15,13,15,15],[16,13,16,15],[17,13,17,15],[12,13,12,15],[15,8,15,12],[16,8,16,12],[19,14,19,16],[19,0,19,2],[19,3,19,4],[19,5,19,7],[19,8,19,9],[19,10,19,13],[18,0,18,16],[4,0,4,5],[4,6,4,8],[10,0,10,3],[7,4,7,16],[8,4,8,16],[9,4,9,7],[9,14,9,16],[15,1,15,7],[11,0,11,7],[11,8,11,12],[5,11,5,13],[10,4,10,12],[6,4,6,12],[16,1,16,7],[17,1,17,7],[4,9,4,10],[12,8,12,12],[13,8,13,12],[14,8,14,12],[4,11,4,12],[5,6,5,8],[12,1,12,7],[13,1,13,7],[14,1,14,7],[10,14,10,16],[9,0,9,3],[9,10,9,12],[6,14,6,16],[5,14,5,16],[9,8,9,9],[7,0,7,3],[8,0,8,3],[5,0,5,5],[6,0,6,3],[0,0,0,16],[3,13,3,14],[2,0,2,2],[3,0,3,2],[2,3,2,8],[3,15,3,16],[3,3,3,8],[3,9,3,10],[3,11,3,12],[2,11,2,12],[2,14,2,16],[2,9,2,10]]}
["Profile for Foster Care Support Needs Assessment Children"]
[]
["Name of Child\n(Legal Name) ",null,null,null,null,null,null,null,null,"Date of Birth",null,null,null,"Age",{"$f":"ClientAge","v":""}]
["Prime #",null,null,null,null,null,null,null,null,"Height",null,null,null,"Weight"]
["Did the individual participate in the Assessment?",null,null,null,null,null,null,null,null,"Gender"]
["Is this an early process assessment?",null,null,null,null,null,null,null,null,null,null,"Date of Assessment"]
["Provider Name",null,null,null,null,null,null,null,null,null,null,null,null,"Phone"]
["Provider Address - Street"]
{"$rows_left_out":19}
{"sheet":"ADLs","index":1,"n_rows":143,"n_cols":4,"rows_kept":143,"cut":false,"hidden":false,"merged":[[2,0,2,1],[1,0,1,1],[13,0,13,1],[14,0,14,1],[9,0,9,1],[10,0,10,1],[97,0,97,1],[98,0,98,1],[109,0,109,1],[110,0,110,1],[101,0,101,1],[102,0,102,1],[120,0,120,1],[121,0,121,1],[143,0,143,1],[113,0,113,1],[114,0,114,1],[142,0,142,1],[135,0,135,1],[136,0,136,1],[131,0,131,1],[132,0,132,1],[124,0,124,1],[125,0,125,1],[21,0,21,1],[22,0,22,1],[51,0,51,1],[52,0,52,1],[25,0,25,1],[26,0,26,1],[33,0,33,1],[34,0,34,1],[47,0,47,1],[48,0,48,1],[38,0,38,1],[37,0,37,1],[59,0,59,1],[60,0,60,1],[89,0,89,1],[90,0,90,1],[85,0,85,1],[86,0,86,1],[72,0,72,1],[73,0,73,1],[63,0,63,1],[65,0,65,1],[76,0,76,1],[78,0,78,1]]}
[]
["AMBULATION / MOBILITY IN THE HOME"]
[{"$f":"IF('Raw Scoring'!B2=5,\"2:1 Review\",\"\")","v":""}]
[null,"This section assesses the individual's physical ability to move around in the individual's home with or without mechanical aids.\nChoose the option that most accurately reflects the supports required by the individual, which are not due to behaviors.\nFor children age 4 years and older, check an option only if the support needed is due to the child's disability.\nDo not check an option for children under age 4 years.\n"]
[]
[null,"Independent or Age Appropriate Supports Provided: The individual can ambulate in familiar surroundings without assistance from another individual with or without mechanical aids.\n","ADL1","HomeAmb1"]
[null,"Partial Assist: The individual is dependent on assistance from another person for some aspect of \nambulation/mobility.\n","ADL1","HomeAmb2"]
[null,"Full Assist: The individual is dependent on assistance from another person for all aspects of \nambulation/mobility.\n","ADL1","HomeAmb3"]
{"$rows_left_out":136}
{"sheet":"Medical Needs","index":2,"n_rows":167,"n_cols":4,"rows_kept":167,"cut":false,"hidden":false,"merged":[[24,0,24,1],[59,0,59,1],[54,0,54,1],[108,0,108,1],[91,0,91,1],[31,0,31,1],[70,0,70,1],[71,0,71,1],[83,0,83,1],[79,0,79,1],[35,0,35,1],[82,0,82,1],[1,0,1,1],[2,0,2,1],[12,0,12,1],[13,0,13,1],[8,0,8,1],[19,0,19,1],[46,0,46,1],[9,0,9,1],[20,0,20,1],[167,0,167,1],[138,0,138,1],[139,0,139,1],[67,0,67,1],[78,0,78,1],[92,0,92,1],[42,0,42,1],[30,0,30,1],[66,0,66,1],[45,0,45,1],[23,0,23,1],[34,0,34,1],[113,0,113,1],[58,0,58,1],[55,0,55,1],[41,0,41,1],[166,0,166,1],[109,0,109,1],[95,0,95,1],[112,0,112,1],[96,0,96,1]]}
[]
["COMMUNICATION - EXPRESSIVE"]
[]
[null,"This section assesses the individual's ability to verbally, or through adaptive means, understandably express to others their needs in their home or community.\nChoose the option that most accurately reflects the supports required by the individual.\nFor children age 2 years and older check an option only if the support needed is due to the child's \ndisability.\nDo not check an option for children under age 2 years."]
[]
[null,"Independent or Age Appropriate Supports Provided: The individual can communicate their needs with or without the use of adaptive equipment and requires no assistance from another person.\n","Medical1","Commexp1"]
[null,"Partial Assist: The individual requires assistance from another person intermittently to express their needs so others will understand them, with or without adaptive communication devices or systems. \n","Medical1","Commexp2"]
[null,"Full Assist: The individual requires ongoing assistance from another person every day to express \ntheir needs so others will understand them, with or without adaptive communication devices or \nsystems.\n","Medical1","Commexp3"]
{"$rows_left_out":160}
{"sheet":"Nursing Assessment Indicators","index":3,"n_rows":0,"n_cols":0,"rows_kept":0,"cut":false,"hidden":false,"merged":[]}

{"sheet":"Nighttime Needs","index":4,"n_rows":30,"n_cols":4,"rows_kept":30,"cut":false,"hidden":false,"merged":[[29,0,29,1],[30,0,30,1],[1,0,1,1],[2,0,2,1],[18,0,18,1],[17,0,17,1],[13,0,13,1],[14,0,14,1]]}
[]
["NIGHTTIME NEEDS - MEDICAL SUPPORTS"]
[{"$f":"IF('Raw Scoring'!G2=5,\"2:1 Review\",\"\")","v":""}]
[null,"This section assesses the individual's need for MEDICAL supports and monitoring during nighttime hours.\nChoose the option that most accurately reflects the supports required by the individual.\n"]
[]
[null,"Not Applicable\n","Nighttime1","Nightmed1"]
[null,"Independent: The individual may or may not have difficulty sleeping but requires no assistance from another person during the hours of 10:00 P.M. and 5:00 A.M.\n","Nighttime1","Nightmed2"]
[null,"Individual Requires Nighttime Assistance - monthly: The individual requires occasional monitoring throughout the month between the hours of 10:00 P.M. and 5:00 A.M.\n","Nighttime1","Nightmed3"]
{"$rows_left_out":23}
{"sheet":"Behavior Needs","index":5,"n_rows":77,"n_cols":4,"rows_kept":77,"cut":false,"hidden":false,"merged":[[15,0,15,1],[11,0,11,1],[66,0,66,1],[1,0,1,1],[2,0,2,1],[14,0,14,1],[43,0,43,1],[28,0,28,1],[38,0,38,1],[10,0,10,1],[54,0,54,1],[29,0,29,1],[42,0,42,1],[24,0,24,1],[78,0,78,1],[25,0,25,1],[62,0,62,1],[63,0,63,1],[77,0,77,1],[39,0,39,1],[67,0,67,1]]}
[]
["BEHAVIORAL SUPPORTS - NO FORMAL PLAN - SUPERVISON AND MONITORING"]
["Supervision and monitoring for behavior and mental health"]
[]
[null,"This section assesses the individual's ability to function in a home and community environment with behavioral supports from another person to maintain safety of self and/or others.  \nThese behaviors do not require a formal behavior support plan and are not addressed in a formal BSP.\nChoose the option that most accurately reflects the supports required by the individual."]
[]
[null,"Not Applicable or Age-Appropriate Supervision:  The individual does not require supervision or monitoring from another person for behavioral issues or, for a child, age-appropriate supervision or monitoring is provided.\n","Behavior1","BehavMin1"]
[null,"Redirecting:  The individual has a transition plan, ISP or mental health guidelines that require redirection \nduring waking hours, to assure the safety of the individual.  This behavior does not require a formal \nbehavior support plan and is not addressed in any formal BSP.\n","Behavior1","BehavMin2"]
{"$rows_left_out":70}
{"sheet":"Foster Care Budget Summary","index":6,"n_rows":25,"n_cols":24,"rows_kept":25,"cut":false,"hidden":false,"merged":[[23,0,23,2],[24,0,24,5],[4,0,4,2],[0,1,0,2],[5,0,5,2],[1,4,1,5],[2,4,2,5],[1,1,1,2],[3,1,3,2],[2,1,2,2],[3,4,3,5],[4,4,4,5],[5,4,5,5],[6,4,6,5],[15,0,15,5],[6,0,6,2],[7,0,7,2],[10,0,10,2],[8,0,8,2],[9,0,9,2],[14,0,14,5],[7,4,7,5],[8,4,8,5],[9,4,9,5],[10,4,10,5],[11,4,11,5]]}
[null,"Foster Care Budget Summary - ",null,"CHILD","SNAP Version:",25.07]
["Name of Individual",{"$f":"IF('Client Demographics'!D3=\"\",\"\",'Client Demographics'!D3)","v":""},null,"Date of Birth",{"$f":"IF('Client Demographics'!L3=\"\",\"\",'Client Demographics'!L3)","v":""},null,null,null,null,null,null,null,null,null,null,null,null,null,null,null,null,null,null,"No"]
["Prime #",{"$f":"IF('Client Demographics'!D4=\"\",\"\",'Client Demographics'!D4)","v":""},null,"Age",{"$f":"IF('Client Demographics'!O3=\"\",\"\",'Client Demographics'!O3)","v":""},null,null,null,null,null,null,null,null,null,null,null,null,null,null,null,null,null,null,"No"]
["Date of Assessment",{"$f":"IF(AsmtDate=\"\",\"\",AsmtDate)","v":""},null,"Assessed Rate","2:1 Review?",null,null,null,null,null,null,null,null,null,null,null,null,null,null,null,null,null,null,"No"]
["Foster Care Initial Support Rate",null,null,{"$f":"IF(E2=\"\",0,IF(DATEDIF(E2,AsmtDate,\"Y\")>=18,\" - \",BaseRate))","v":0},"N/A",null,null,null,null,null,null,null,null,null,null,null,null,null,null,null,null,null,null,"No"]
["ADL Supports",null,null,null,{"$f":"'Raw Scoring'!B15","v":"No"},null,null,null,null,null,null,null,null,null,null,null,null,null,null,null,null,null,null,"No"]
["Behavior Supports",null,null,null,{"$f":"'Raw Scoring'!Q8","v":"No"},null,null,null,null,null,null,null,null,null,null,null,null,null,null,null,null,null,null,"No"]
["Medical Supports",null,null,null,{"$f":"'Raw Scoring'!L19","v":"No"},null,null,null,null,null,null,null,null,null,null,null,null,null,null,null,null,null,null,"No"]
{"$rows_left_out":18}
{"sheet":"Host Home Budget Summary","index":7,"n_rows":22,"n_cols":24,"rows_kept":22,"cut":false,"hidden":true,"merged":[[19,1,19,2],[21,0,21,5],[12,1,12,2],[4,0,4,1],[6,0,6,5],[18,1,18,5],[7,1,7,2],[9,0,10,0],[9,1,10,5],[14,1,14,2],[16,0,16,5],[0,0,0,5],[1,1,1,2],[1,4,1,5],[2,1,2,2],[2,4,2,5]]}
["Host Home Budget Summary"]
["Name of Individual",{"$f":"IF('Client Demographics'!D3=\"\",\"\",'Client Demographics'!D3)","v":""},null,"Date of Birth",{"$f":"IF('Client Demographics'!L3=\"\",\"\",'Client Demographics'!L3)","v":""}]
["Date of Assessment",{"$f":"IF('Client Demographics'!O6=\"\",\"\",'Client Demographics'!O6)","v":""},null,"Age",{"$f":"IF('Client Demographics'!O3=\"\",\"\",'Client Demographics'!O3)","v":""}]
[]
[null,null,null,"Approved Rate",{"$f":"HHRawScoring!F36","v":2153}]
[]
["My signature verifies I have completed the Support Needs Assessment Profile using all available information\nobtained through observation, interview and the individual's records. The assessment accurately reflects the individual's\nsupport needs."]
["Completed by:",{"$f":"IF('Client Demographics'!E11=\"\",\"\",'Client Demographics'!E11)","v":""},null,"Signature:__________________________",null,"Date:____________"]
{"$rows_left_out":15}
{"sheet":"Children Rate Information","index":8,"n_rows":0,"n_cols":0,"rows_kept":0,"cut":false,"hidden":true,"merged":[]}

{"sheet":"Support Needs Summary","index":9,"n_rows":149,"n_cols":4,"rows_kept":149,"cut":false,"hidden":false,"merged":[]}
["SUPPORT NEEDS SUMMARY"]
[]
["ADLs","Support Needs Category"]
[null,{"$f":"ADLs!A2","v":"AMBULATION / MOBILITY IN THE HOME"}]
[null,"Support Need","2:1 Review?","Documentation Needed"]
[null,"Independent or Age Appropriate Supports Provided","No","None"]
[null,"Support Needs Category"]
[null,{"$f":"ADLs!A14","v":"AMBULATION / MOBILITY IN THE COMMUNITY"}]
{"$rows_left_out":142}
{"sheet":"MFCU Use Only","index":10,"n_rows":23,"n_cols":2,"rows_kept":23,"cut":false,"hidden":true,"merged":[[0,0,0,2],[2,0,2,1]]}
["Medically Fragile Children Served in Foster Care"]
[]
["Instructions"]
["Complete Support Needs Assessment Profile normally with"]
["the exception of Consultant Hours. "]
["The consultant section in the Budget Summary should be left blank and filled in below."]
[]
[]
{"$rows_left_out":16}
{"sheet":"Raw Scoring","index":11,"n_rows":86,"n_cols":27,"rows_kept":86,"cut":false,"hidden":true,"merged":[[33,7,33,8],[33,9,33,10],[36,1,36,3],[20,14,20,15]]}
[null,"From Assessment","Real Scoring","Exception?","Hours",null,"From Assessment","Real Scoring","Exception?","Hours",null,"From Assessment","Real Scoring","Exception?","Hours",null,"From Assessment",null,null,"Real Scoring","Exception?","Hours","DPAdjustment","Exception?","HostHomeConsideration#","HostHome","HHResult"]
["ADL1",0,{"$f":"(IF(B2=5,4,B2))","v":0},{"$f":"IF(B2=5,\"Yes\",\"No\")","v":"No"},{"$f":"IF($C$36<6,VLOOKUP(C2,'New Scoring'!B2:H7,5),IF($C$36<10,VLOOKUP(C2,'New Scoring'!B2:H7,7),VLOOKUP(C2,'New Scoring'!B2:H7,2)))","v":0},"Nighttime1",0,{"$f":"(IF(G2=5,4,G2))","v":0},{"$f":"IF(G2=5,\"Yes\",\"No\")","v":"No"},{"$f":"IF($C$36<6,VLOOKUP(H2,'New Scoring'!B74:H79,5),IF($C$36<10,VLOOKUP(H2,'New Scoring'!B74:H79,7),VLOOKUP(H2,'New Scoring'!B74:H79,2)))","v":0},"Medical1",0,{"$f":"(IF(L2=5,4,L2))","v":0},{"$f":"IF(L2=5,\"Yes\",\"No\")","v":"No"},{"$f":"IF($C$36<6,VLOOKUP(M2,'New Scoring'!B86:H91,5),IF($C$36<10,VLOOKUP(M2,'New Scoring'!B86:H91,7),VLOOKUP(M2,'New Scoring'!B86:H91,2)))","v":0},"Behavior1",0,null,null,{"$f":"(IF(T4>1,0,Q2))","v":0},{"$f":"IF(Q2=5,\"Yes\",\"No\")","v":"No"},{"$f":"IF($C$36<6,VLOOKUP(T2,'New Scoring'!B182:H187,5),IF($C$36<10,VLOOKUP(T2,'New Scoring'!B182:H187,7),VLOOKUP(T2,'New Scoring'!B182:H187,2)))","v":0},0,"No",1,"No",{"$f":"IF(COUNTIF(Z2:Z36,\"Yes\")>0,\"Yes\",\"No\")","v":"No"}]
["ADL2",0,{"$f":"(IF(T6 > 2, 0, IF(B3=5,4,B3)))","v":0},{"$f":"IF(B3=5,\"Yes\",\"No\")","v":"No"},{"$f":"IF($C$36<6,VLOOKUP(C3,'New Scoring'!B8:H13,5),IF($C$36<10,VLOOKUP(C3,'New Scoring'!B8:H13,7),VLOOKUP(C3,'New Scoring'!B8:H13,2)))","v":0},"Nighttime2",0,{"$f":"(IF(G3=5,4,G3))","v":0},{"$f":"IF(G3=5,\"Yes\",\"No\")","v":"No"},{"$f":"IF($C$36<6,VLOOKUP(H3,'New Scoring'!B80:H85,5),IF($C$36<10,VLOOKUP(H3,'New Scoring'!B80:H85,7),VLOOKUP(H3,'New Scoring'!B80:H85,2)))","v":0},"Medical2",0,{"$f":"(IF(L3=5,4,L3))","v":0},{"$f":"IF(L3=5,\"Yes\",\"No\")","v":"No"},{"$f":"IF($C$36<6,VLOOKUP(M3,'New Scoring'!B92:H97,5),IF($C$36<10,VLOOKUP(M3,'New Scoring'!B92:H97,7),VLOOKUP(M3,'New Scoring'!B92:H97,2)))","v":0},"Behavior2",0,null,null,{"$f":"(IF(Q3=5,4,Q3))","v":0},{"$f":"IF(Q3=5,\"Yes\",\"No\")","v":"No"},{"$f":"IF($C$36<6,VLOOKUP(T3,'New Scoring'!B188:H193,5),IF($C$36<10,VLOOKUP(T3,'New Scoring'!B188:H193,7),VLOOKUP(T3,'New Scoring'!B188:H193,2)))","v":0},null,"No",2,"No",{"$f":"COUNTIF(Z2:Z36,\"Yes\")","v":0}]
["ADL3",0,{"$f":"(IF(B4=5,4,B4))","v":0},"No",{"$f":"IF($C$36<6,VLOOKUP(C4,'New Scoring'!B14:H19,5),IF($C$36<10,VLOOKUP(C4,'New Scoring'!B14:H19,7),VLOOKUP(C4,'New Scoring'!H14:BB19,2)))","v":0},"Totals",{"$f":"G2+G3","v":0},{"$f":"MAX(H2:H3)","v":0},{"$f":"COUNTIF(I2:I3,\"Yes\")","v":0},{"$f":"SUM(J2:J3)","v":0},"Medical3",0,0,"No",{"$f":"IF($C$36<6,VLOOKUP(M4,'New Scoring'!B98:H103,5),IF($C$36<10,VLOOKUP(M4,'New Scoring'!B98:H103,7),VLOOKUP(M4,'New Scoring'!B98:H103,2)))","v":0},"Behavior3",0,null,null,{"$f":"IF(X5 = 4,2,IF(X5>4,3,IF(Q4=5,4,Q4)))","v":3},{"$f":"IF(Q4=7,\"Yes\",\"No\")","v":"No"},{"$f":"IF($C$36<6,VLOOKUP(T4,'New Scoring'!B194:H199,5),IF($C$36<10,VLOOKUP(T4,'New Scoring'!B194:H199,7),VLOOKUP(T4,'New Scoring'!B194:H199,2)))","v":2},"BehaviorDupChecks","No",3,"No"]
["ADL4",0,{"$f":"(IF(B5=5,4,B5))","v":0},"No",{"$f":"IF($C$36<6,VLOOKUP(C5,'New Scoring'!B20:H25,5),IF($C$36<10,VLOOKUP(C5,'New Scoring'!B20:H25,7),VLOOKUP(C5,'New Scoring'!B20:H25,2)))","v":0},"Exception?",{"$f":"IF(I4>0,\"Yes – Approval Required (see eXPRS)\",\"No\")","v":"No"},null,null,null,"Medical4",0,0,"No",{"$f":"IF($C$36<6,VLOOKUP(M5,'New Scoring'!B104:H109,5),IF($C$36<10,VLOOKUP(M5,'New Scoring'!B104:H109,7),VLOOKUP(M5,'New Scoring'!B104:H109,2)))","v":0},"Behavior4",0,null,null,{"$f":"(IF(Q5=7,6,Q5))","v":0},{"$f":"IF(Q5=7,\"Yes\",\"No\")","v":"No"},{"$f":"IF($C$36<6,VLOOKUP(T5,'New Scoring'!B200:H207,5),IF($C$36<10,VLOOKUP(T5,'New Scoring'!B200:H207,7),VLOOKUP(T5,'New Scoring'!B200:H207,2)))","v":0},null,"No",4,"No"]
["ADL5",0,0,"No",{"$f":"IF($C$36<6,VLOOKUP(C6,'New Scoring'!B26:H31,5),IF($C$36<10,VLOOKUP(C6,'New Scoring'!B26:H31,7),VLOOKUP(C6,'New Scoring'!B26:H31,2)))","v":0},null,null,null,null,null,"Medical5",0,0,"No",{"$f":"IF($C$36<6,VLOOKUP(M6,'New Scoring'!B110:H115,5),IF($C$36<10,VLOOKUP(M6,'New Scoring'!B110:H115,7),VLOOKUP(M6,'New Scoring'!B110:H115,2)))","v":0},"Behavior5",0,null,null,{"$f":"IF(X4>6,IF(X4 = 7,2,4),IF(Q6=5,4,Q6))","v":4},{"$f":"IF(Q6=5,\"Yes\",\"No\")","v":"No"},{"$f":"IF($C$36<6,VLOOKUP(T6,'New Scoring'!B208:H213,5),IF($C$36<10,VLOOKUP(T6,'New Scoring'!B208:H213,7),VLOOKUP(T6,'New Scoring'!B208:H213,2)))","v":2},null,"No",5,"No"]
["ADL6",0,0,"No",{"$f":"IF($C$36<6,VLOOKUP(C7,'New Scoring'!B32:H37,5),IF($C$36<10,VLOOKUP(C7,'New Scoring'!B32:H37,7),VLOOKUP(C7,'New Scoring'!B32:H37,2)))","v":0},null,null,null,null,null,"Medical6",0,0,"No",{"$f":"IF($C$36<6,VLOOKUP(M7,'New Scoring'!B116:H121,5),IF($C$36<10,VLOOKUP(M7,'New Scoring'!B116:H121,7),VLOOKUP(M7,'New Scoring'!B116:H121,2)))","v":0},"Totals",{"$f":"SUM(Q2:Q6)","v":0},null,null,{"$f":"SUM(T2:T6)","v":7},{"$f":"COUNTIF(U2:U6,\"Yes\")","v":0},{"$f":"SUM(V2:V6)","v":4},null,"No",6,"No"]
["ADL7",0,0,"No",{"$f":"IF($C$36<6,VLOOKUP(C8,'New Scoring'!B38:H43,5),IF($C$36<10,VLOOKUP(C8,'New Scoring'!B38:H43,7),VLOOKUP(C8,'New Scoring'!B38:H43,2)))","v":0},null,null,null,null,null,"Medical7",0,0,"No",{"$f":"IF($C$36<6,VLOOKUP(M8,'New Scoring'!B122:H127,5),IF($C$36<10,VLOOKUP(M8,'New Scoring'!B122:H127,7),VLOOKUP(M8,'New Scoring'!B122:H127,2)))","v":0},"Exception?",{"$f":"IF(U7>0,\"Yes – Approval Required (see eXPRS)\",\"No\")","v":"No"},null,null,null,null,null,null,null,7,"No"]
{"$rows_left_out":79}
{"sheet":"New Scoring","index":12,"n_rows":213,"n_cols":9,"rows_kept":213,"cut":false,"hidden":true,"merged":[]}
["Category","Assessment Score ","Corresponding Hours >9","Pricing",null,"Hours 0 to 5","Pricing 0 to 5","Hours 6 to 9","Pricing 6 to 9"]
["ADL1",0,0,{"$f":"ROUND(C2*30.41*9.5,0)","v":0},null,0,{"$f":"ROUND(F2*30.41*9.5,0)","v":0},0,{"$f":"ROUND(H2*30.41*9.5,0)","v":0}]
["ADL1",1,1,{"$f":"ROUND(C3*30.41*9.5,0)","v":289},null,0,0,0,0]
["ADL1",2,1,289,null,0,0,0,0]
["ADL1",3,1,289,null,0,0,0,0]
["ADL1",4,2,578,null,0,0,1,289]
["ADL1",5,2,578,null,0,0,1,289]
["ADL2",0,0,0,null,0,0,0,0]
{"$rows_left_out":206}
{"sheet":"HHRawScoring","index":13,"n_rows":36,"n_cols":25,"rows_kept":36,"cut":false,"hidden":true,"merged":[[26,7,26,8],[26,11,26,12]]}
[null,"From Assessment","Real Scoring","Exception?","Hours",null,"From Assessment","Real Scoring","Exception?","Hours",null,"From Assessment","Real Scoring","Exception?","Hours",null,"From Assessment","Real Scoring","Exception?","Hours",null,null,"HostHomeConsideration#","HostHome","HHResult"]
["ADL1",{"$f":"'Raw Scoring'!B2","v":0},{"$f":"(IF(B2=5,4,B2))","v":0},{"$f":"IF(B2=5,\"Yes\",\"No\")","v":"No"},{"$f":"LOOKUP(C2,'New Scoring'!B2:B7,'New Scoring'!C2:C7)","v":0},"Nighttime1",{"$f":"'Raw Scoring'!G2","v":0},{"$f":"(IF(G2=5,4,G2))","v":0},{"$f":"IF(G2=5,\"Yes\",\"No\")","v":"No"},{"$f":"LOOKUP(H2,'New Scoring'!B74:B79,'New Scoring'!C74:C79)","v":0},"Medical1",{"$f":"'Raw Scoring'!L2","v":0},{"$f":"(IF(L2=5,4,L2))","v":0},{"$f":"IF(L2=5,\"Yes\",\"No\")","v":"No"},{"$f":"LOOKUP(M2,'New Scoring'!B86:B91,'New Scoring'!C86:C91)","v":0},"Behavior1",{"$f":"'Raw Scoring'!Q2","v":0},{"$f":"(IF(R4>1,0,Q2))","v":0},{"$f":"IF(Q2=5,\"Yes\",\"No\")","v":"No"},{"$f":"LOOKUP(R2,'New Scoring'!B182:B187,'New Scoring'!C182:C187)","v":0},null,null,1,{"$f":"'Raw Scoring'!Z2","v":"No"},{"$f":"IF(COUNTIF(X2:X36,\"Yes\")>0,\"Yes\",\"No\")","v":"No"}]
["ADL2",{"$f":"'Raw Scoring'!B3","v":0},{"$f":"(IF(R6 > 2, 0, IF(B3=5,4,B3)))","v":0},{"$f":"IF(B3=5,\"Yes\",\"No\")","v":"No"},{"$f":"LOOKUP(C3,'New Scoring'!B8:B13,'New Scoring'!C8:C13)","v":0},"Nighttime2",{"$f":"'Raw Scoring'!G3","v":0},{"$f":"(IF(G3=5,4,G3))","v":0},{"$f":"IF(G3=5,\"Yes\",\"No\")","v":"No"},{"$f":"LOOKUP(H3,'New Scoring'!B80:B85,'New Scoring'!C80:C85)","v":0},"Medical2",{"$f":"'Raw Scoring'!L3","v":0},{"$f":"(IF(L3=5,4,L3))","v":0},{"$f":"IF(L3=5,\"Yes\",\"No\")","v":"No"},{"$f":"LOOKUP(M3,'New Scoring'!B92:B97,'New Scoring'!C92:C97)","v":0},"Behavior2",{"$f":"'Raw Scoring'!Q3","v":0},{"$f":"(IF(Q3=5,4,Q3))","v":0},{"$f":"IF(Q3=5,\"Yes\",\"No\")","v":"No"},{"$f":"LOOKUP(R3,'New Scoring'!B188:B193,'New Scoring'!C188:C193)","v":0},null,null,2,{"$f":"'Raw Scoring'!Z3","v":"No"},{"$f":"COUNTIF(X2:X36,\"Yes\")","v":0}]
["ADL3",{"$f":"'Raw Scoring'!B4","v":0},{"$f":"(IF(B4=5,4,B4))","v":0},"No",{"$f":"LOOKUP(C4,'New Scoring'!B14:B19,'New Scoring'!C14:C19)","v":0},"Totals",{"$f":"G2+G3","v":0},{"$f":"MAX(H2:H3)","v":0},{"$f":"COUNTIF(I2:I3,\"Yes\")","v":0},{"$f":"SUM(J2:J3)","v":0},"Medical3",{"$f":"'Raw Scoring'!L4","v":0},0,"No",{"$f":"LOOKUP(M4,'New Scoring'!B98:B103,'New Scoring'!C98:C103)","v":0},"Behavior3",{"$f":"'Raw Scoring'!Q4","v":0},{"$f":"IF(V5 = 4,2,IF(V5>4,3,IF(Q4=5,4,Q4)))","v":0},{"$f":"IF(Q4=7,\"Yes\",\"No\")","v":"No"},{"$f":"LOOKUP(R4,'New Scoring'!B194:B199,'New Scoring'!C194:C199)","v":0},"BehaviorDupChecks",{"$f":"Q6+B3","v":0},3,{"$f":"'Raw Scoring'!Z4","v":"No"}]
["ADL4",{"$f":"'Raw Scoring'!B5","v":0},{"$f":"(IF(B5=5,4,B5))","v":0},"No",{"$f":"LOOKUP(C5,'New Scoring'!B20:B25,'New Scoring'!C20:C25)","v":0},"Exception?",{"$f":"IF(I4>0,\"Yes\",\"No\")","v":"No"},null,null,null,"Medical4",{"$f":"'Raw Scoring'!L5","v":0},0,"No",{"$f":"LOOKUP(M5,'New Scoring'!B104:B109,'New Scoring'!C104:C109)","v":0},"Behavior4",{"$f":"'Raw Scoring'!Q5","v":0},{"$f":"(IF(Q5=7,6,Q5))","v":0},{"$f":"IF(Q5=7,\"Yes\",\"No\")","v":"No"},{"$f":"LOOKUP(R5,'New Scoring'!B200:B207,'New Scoring'!C200:C207)","v":0},null,{"$f":"Q2+Q4","v":0},4,{"$f":"'Raw Scoring'!Z5","v":"No"}]
["ADL5",{"$f":"'Raw Scoring'!B6","v":0},0,"No",{"$f":"LOOKUP(C6,'New Scoring'!B26:B31,'New Scoring'!C26:C31)","v":0},null,null,null,null,null,"Medical5",{"$f":"'Raw Scoring'!L6","v":0},0,"No",{"$f":"LOOKUP(M6,'New Scoring'!B110:B115,'New Scoring'!C110:C115)","v":0},"Behavior5",{"$f":"'Raw Scoring'!Q6","v":0},{"$f":"IF(V4>6,IF(V4 = 7,2,4),IF(Q6=5,4,Q6))","v":0},{"$f":"IF(Q6=5,\"Yes\",\"No\")","v":"No"},{"$f":"LOOKUP(R6,'New Scoring'!B208:B213,'New Scoring'!C208:C213)","v":0},null,null,5,{"$f":"'Raw Scoring'!Z6","v":"No"}]
["ADL6",{"$f":"'Raw Scoring'!B7","v":0},0,"No",{"$f":"LOOKUP(C7,'New Scoring'!B32:B37,'New Scoring'!C32:C37)","v":0},null,null,null,null,null,"Medical6",{"$f":"'Raw Scoring'!L7","v":0},0,"No",{"$f":"LOOKUP(M7,'New Scoring'!B116:B121,'New Scoring'!C116:C121)","v":0},"Totals",{"$f":"SUM(Q2:Q6)","v":0},{"$f":"SUM(R2:R6)","v":0},{"$f":"COUNTIF(S2:S6,\"Yes\")","v":0},{"$f":"SUM(T2:T6)","v":0},null,null,6,{"$f":"'Raw Scoring'!Z7","v":"No"}]
["ADL7",{"$f":"'Raw Scoring'!B8","v":0},0,"No",{"$f":"LOOKUP(C8,'New Scoring'!B38:B43,'New Scoring'!C38:C43)","v":0},null,null,null,null,null,"Medical7",{"$f":"'Raw Scoring'!L8","v":0},0,"No",{"$f":"LOOKUP(M8,'New Scoring'!B122:B127,'New Scoring'!C122:C127)","v":0},"Exception?",{"$f":"IF(S7>0,\"Yes\",\"No\")","v":"No"},null,null,null,null,null,7,{"$f":"'Raw Scoring'!Z8","v":"No"}]
{"$rows_left_out":29}
{"sheet":"HHScoring","index":14,"n_rows":213,"n_cols":5,"rows_kept":213,"cut":false,"hidden":true,"merged":[]}
["Category","Assessment Score","Corresponding Hours",null,"Pricing"]
["ADL1",0,0,null,{"$f":"ROUND(C2*30.41*9.5,0)","v":0}]
["ADL1",1,1,null,{"$f":"ROUND(C3*30.41*9.5,0)","v":289}]
["ADL1",2,1,null,289]
["ADL1",3,1,null,289]
["ADL1",4,2,null,578]
["ADL1",5,2,null,578]
["ADL2",0,0,null,0]
{"$rows_left_out":205}