{"text_format":"1","workbook":"xlsx","n_sheets":6,"sheets":["Instructions","Budget Report","Narrative","Data Validation","Certification","Data Entry Import"],"not_rendered":{"charts":0,"images":1,"macros":1,"external_links":1,"defined_names":53,"comments":0,"pivot_tables":0},"unopened":[],"bounds":{"document_bytes":16777216,"sheet_cells":100000,"rows_first":2000,"rows_last":500,"rows_between":2000,"halvings":0,"cell_chars":16384,"cell_head_chars":4096},"cells_cut":0,"cells_raw":0,"read":"whole","date_system":"1900"}

{"sheet":"Instructions","index":0,"n_rows":9,"n_cols":4,"rows_kept":9,"cut":false,"hidden":true,"merged":[[9,9,11,21],[21,11,25,23],[1,2,1,3],[5,0,6,0]]}
[]
[null,"Purpose of This File","OHA Public Health Division provides grant funding to organizations for work related to M110 \n• To report expenses for funding received, you must complete 'Budget Cat. &Service Area' \n• Once the workbook has been completed, certify the report by signing 'Authorized Agent Signature' (Cell B10 in Certification Tab). "]
[]
[null,"Tab ","Instruction","Tab Completion Checklist"]
[null,"Instructions","This expenditure report is submitted quarterly, and documents cumulative expenses incurred for the 2022 M110 contract. Expenditure reports should be submitted to OHA one month after the quarter end date.  \n\ni.e. Expenditure reports for January 1st, 2022 - March 31st, 2022 are due to OHA by April 30th, 2022.","• Please fill in applicable cells highlighted in blue\n"]
[null,"1. Budget Cat. &Service Area","Please complete the following:\n• Your BHRN name in Cell D6.\n• Your organization's name  in Cell D7.\n• Your Grant agreement number in Cell D8\n• The quarter end date in Cell D9.\nSection A: M110 EXPENDITURES BY BUDGET CATEGORY \n• Allocate your Personnel (Salaries) and Fringe Benefits costs in the appropriate quarter (Row 13).\n• Allocate Program Staff Training Costs in the appropriate quarter (Row 14).\n• Allocate Services and Supplies Costs in the appropriate quarter (Row 15).\n• Allocate Capital Equipment in the appropriate quarter (Row 16). \nSection B: M110 EXPENDITURES BY SERVICE AREA\n• Allocate Section A expenditures to the appropriate category:\n            • Screening and Comp Behavioral Health Needs \n            • Individual Intervention Planning \n            • Low Barrier Substance Use Treatment\n            • Peer Support, Mentoring, etc.\n            • Housing Services\n            • Harm Reduction Intervention \n            • Supported Employment \n\nNote: If the file has red indicators, then Section A is not balanced with Section B.","1. Verify that you have entered in your BHRN name  (Cell D6). \n\n2. Verify that Section A Total Expenditures (Cell H17) balances with your Section B Total Expenditures (Cell E28).\n\n3. Verify that all cells highlighted in blue have been filled in (if applicable).\n\n4. Verify that all previous quarters expenses prior quarterly expenditure data are included, this report is cumulative and will capture all expenditures incurred since the start of the contract.\n\n\n"]
[null,"2. Narrative","Please complete the following:\n• Narrative Explanation of funding (Cell C3:C14) this a broad description of what the funds are being spent on. Please include any information that will show impact of dollars spent. This could include any outputs or outcomes, any stories of impact, or general numbers of clients served in each area. "]
[null,"3. Certification","Please complete the following:\n• Check box to confirm that all funding is from M110\n• Check box to attest that data and narratives are accurate \n• Complete prepared by and authorized agent signature boxes \n"]
[null,"4. Data Entry Import","This tab will auto populate after tabs 1 and 2 are completed, it is used to check for completeness."]

{"sheet":"Budget Report","index":1,"n_rows":44,"n_cols":64,"rows_kept":44,"cut":false,"hidden":false,"merged":[[1,3,1,4],[2,3,2,4],[3,3,3,4],[23,1,23,2],[13,1,13,4],[37,7,44,8],[26,7,33,8],[36,1,36,5],[27,63,27,72],[5,10,5,12],[25,10,25,12],[25,1,25,5]]}
[]
[null,null,null,"OREGON HEALTH AUTHORITY",null,"Legend"]
[null,null,null,"Health Services Division (HSD)",null,"Blue cells - require input"]
[null,null,null,"Behavioral Health Measure 110 - Budget Report Template",null,"Gray cells - auto populate "]
[]
[null,null,"BHRN Name: ","Yamhill_County"]
[null,null,"Organization Name: "]
[null,null,"Grant Agreement #: ",{"$f":"IFERROR(INDEX('Data Validation'!J:J,MATCH('Data Validation'!D1,'Data Validation'!E:E,0)),\"\")","v":""}]
[null,null,"Contract Not-to-Exceed Amount: ",{"$f":"IFERROR(INDEX('Data Validation'!$AY:$AY,MATCH('Data Validation'!$D$1,'Data Validation'!$E:$E,0)),0)","v":0}]
[]
{"$rows_left_out":35}
{"sheet":"Narrative","index":2,"n_rows":14,"n_cols":5,"rows_kept":14,"cut":false,"hidden":true,"merged":[]}
[]
[null,"Budget Category","Narrative Explanation of Spending",null,"Legend"]
[null,"Personnel Costs ",null,null,"Blue cells - require input"]
[null,"Program Staff Training Costs",null,null,"Gray cells - auto populate "]
[null,"Services and Supplies Costs"]
[null,"Capital Outlay Costs"]
[null,"Service Area","Narrative Explanation of Spending"]
[null,"Screening and Comp Behavioral Health Needs "]
[null,"Individual Intervention Planning "]
[null,"Low Barrier Substance Use Treatment"]
{"$rows_left_out":5}
{"sheet":"Data Validation","index":3,"n_rows":271,"n_cols":123,"rows_kept":271,"cut":false,"hidden":true,"merged":[]}
[null,null,null,{"$f":"_xlfn.CONCAT(D2,'Budget Report'!D7)","v":"Yamhill County"}]
[null,null,null,{"$f":"INDEX(C:C,MATCH('Budget Report'!D6,'Data Validation'!B:B,0))","v":"Yamhill County"},"ID","County","County ID","BHRN Name","BHRN ID","Grant Number","Grantee Name","Legal Name","Grant ID","SOS Check Complete","SOS Expiration Date","SOS Expired","Access to Care Grantee","Access to Care Grant Agreement Number","Access to Care End Date","Insurance Confirmation","License Expiration Date","Workers' Comp & Employers' Liability (both >$500k)","Commercial General Liability occur>$1m; annual>$2m","Professional Liability occur>$1m; annual>$2m","COI Saved to Teams","COI Notes","Grant Agreement Number","Grant Agreement # w/ Amendment","Grant Agreement Execution Date","Date of Last BHRN Grant Agreement Execution","MOU Due Date","MOU Received Date (From BHRN Grantee)","MOU Execution Date","MOU Submission Date","MOU Saved to Teams?","MOU Email Saved to Teams","MOU Days Outstanding","Policies and Procedures Submitted","C&L Specific Svcs Submission","C&L Responsive Svcs Submission","APIDD Submission Date","APPD Submission Date","GARC Submission Date","LGBTQIA2S+ AIS Submission Date","YFIS Submission Date","PC&N Svcs Submission Date","TIE & C Submission Date","SPYC Submission Date","MOU Payment Due Date","Amount Approved","Grant Agreement NTE Amount","Approved vs. Signed Amount Variance","MOU Milestone Payment Amount","Quarterly Payment Amount","Quarterly Payments","Total Amount to be Paid","Total to be Paid vs. Grant Agreement NTE","Ready for MOU Payment","Payment w/o MOU","Amount Paid to Date","Payment Variance","Personnel Costs","Program Staff Training Costs","Services and Supplies Costs","Capital Outlay Costs","Admin Costs","Calculated Total Costs","Budget Table vs. Grant Agreement Variance","Budget Table Notes","Personnel Costs","Program Staff Training Costs","Services and Supplies Costs","Capital Outlay Costs","Admin Costs","Calculated Total Costs",null,"Example","Baker","Benton","Clackamas","Clatsop","Columbia","Columbia_County","Coos","Crook","Curry","Deschutes","Douglas","Gilliam","Grant","Harney","Hood_River_County","Jackson_County","Jefferson","Josephine","Klamath","Klamath_Child_and_Family_Treatment_Center","Lake","Lane_BHRN_#1","Lane_BHRN_2","Lane_BHRN_3","Lincoln_County_BHRN_1","Lincoln_County_BHRN_2","Linn","Malheur","Marion","Morrow","East_Multnomah_BHRN_Providers","Indigeninity_BHRN_Providers","Latino_a_x_Multnomah_County_BHRN","No_Wrong_Door_BHRN_Providers","Polk","Sherman","Tillamook","Tribal","Umatilla","Union","Wallowa","Wasco","Washington","Wheeler","Brightside","Yamhill_County"]
[null,null,null,null,{"$f":"_xlfn.CONCAT(H3,K3)","v":"ExampleGood Example"},null,null,"Example",null,123456,"Good Example",null,null,null,null,null,null,null,null,null,null,null,null,null,null,null,null,null,null,null,null,null,null,null,null,null,null,null,null,null,null,null,null,null,null,null,null,null,null,{"$f":"AY3","v":154000},{"$f":"BO3","v":154000},null,{"$f":"AY3*0.4","v":61600},null,null,null,null,null,null,null,null,100000,5000,25000,10000,{"$f":"140000*0.1","v":14000},{"$f":"SUM(BJ3:BN3)","v":154000},null,null,{"$f":"IFERROR(BJ3/$BO3,\"\")","v":0.64935064935064934},{"$f":"IFERROR(BK3/$BO3,\"\")","v":3.2467532467532464E-2},{"$f":"IFERROR(BL3/$BO3,\"\")","v":0.16233766233766234},{"$f":"IFERROR(BM3/$BO3,\"\")","v":6.4935064935064929E-2},{"$f":"IFERROR(BN3/$BO3,\"\")","v":9.0909090909090912E-2},null,null,"Good Example","New Directions NW","Benton County Health Department","Bridges to Change","Clatsop Behavioral Healthcare","Boulder Care, Inc.","Boulder Care, Inc.","Adapt","BestCare Treatment Services, Inc.","Adapt","BestCare Treatment Services, Inc.","Adapt","Boulder Care, Inc.","Boulder Care, Inc.","Symmetry Care, Inc.","Columbia Gorge Health Council","Stabbin' Wagon","BestCare Treatment Services, Inc.","BestCare Treatment Services, Inc.","Max's Mission","Max's Mission","North Lake Health Center, Inc.","Community Outreach Through Radical Empowerment (CORE)","Addiction Counseling and Education Services (Emergence)","Centro Latino Americano","Coastal Phoenix Rising","CHANCE","Addiction Counseling and Education Services (Emergence)","Eastern Oregon Center for Independent Living","Bridgeway","Community Counseling Solutions","Bright Transitions","Alano Club of Portland","Central City Concern Puentes","Cascade Aids Project","Polk County","Boulder Care, Inc.","Adventist Health Tillamook","Burns Paiute Tribe","Community Counseling Solutions","Center for Human Development","Boulder Care, Inc.","Bridges to Change","Bridges to Change","Boulder Care, Inc.","Recovery Works NW","Alano Club"]
[null,null,null,null,"ExampleBad Example",null,null,"Example",null,123457,"Bad Example",null,null,null,null,null,null,null,null,null,null,null,null,null,null,null,null,null,null,null,null,null,null,null,null,null,null,null,null,null,null,null,null,null,null,null,null,null,null,{"$f":"AY4","v":79500},{"$f":"BO4","v":79500},null,{"$f":"AY4*0.4","v":31800},null,null,null,null,null,null,null,null,50000,2500,15000,5000,7000,{"$f":"SUM(BJ4:BN4)","v":79500},-0.68000000005122296,null,{"$f":"IFERROR(BJ4/$BO4,\"\")","v":0.62893081761006286},3.1446540880503145E-2,{"$f":"IFERROR(BL4/$BO4,\"\")","v":0.18867924528301888},{"$f":"IFERROR(BM4/$BO4,\"\")","v":6.2893081761006289E-2},{"$f":"IFERROR(BN4/$BO4,\"\")","v":8.8050314465408799E-2},null,null,"Bad Example",null,"CHANCE","Cascadia Behavioral Healthcare","Clatsop Community Action","Columbia Community Mental Health","Columbia Community Mental Health","Bay Area First Step Inc.","Ideal Option","Brookings Community Resource Response","Boulder Care, Inc.","Boulder Care, Inc.","Community Counseling Solutions","Community Counseling Solutions",null,"Hood River County Health Dept.","Addiction Recovery Center",null,"Adapt","Red is the Road to Wellness","Red is the Road to Wellness",null,"Daisy C.H.A.I.N.","Center for Family Development","HIV Alliance","Faith, Hope and Charity, Inc. (FHC)","Phoenix Wellness Center LLC","Albany Comprehensive Treatment (CRC Health OR)","Lifeways","HIV Alliance",null,"Cascadia Behavioral Healthcare, Inc.","Bridges to Change","Fresh-Out Community Based Re-Entry Program","Cascadia Behavioral Healthcare","Youth Era","Mid-Columbia Center for Living","CARE","Coquille Indian Tribe","Eastern Oregon Alcoholism Foundation","Eastern Oregon Center for Independent Living","Wallowa Valley Center for Wellness","Columbia Gorge Health Council","CODA, Inc.","Community Counseling Solutions",null,"Encompass Yamhill Valley"]
[null,"Name Manager Name","BHRN Name",null,"BakerNew Directions NW","Baker","01","Baker","01",176574,"New Directions NW","New Directions Northwest, Inc.","084",true,"2023-05-15","Valid",true,170823,null,null,null,null,null,null,null,null,176574,"176574-0","2022-06-16","2022-06-16","2022-07-16",null,"N/A","N/A","No MOU Required","No MOU Required","Complete",0,null,null,null,null,null,null,null,null,null,null,"2022-07-16",860829,860829,0,344331.6,86082.9,6,860829,0,"Yes","No",344331.6,0,565207.39,0,190857.13,41000,63765.16,860829.68,-0.68000000005122296,null,0.65658445930907028,0,0.22171299902205974,4.7628469315788458E-2,7.4074072353081499E-2,null,null,null,null,"Corvallis Housing First","Harmony Academy Recovery","Clatsop County Public Health","Iron Tribe Network","Iron Tribe Network","Coos Health & Wellness","Rimrock Trails Treatment Services",null,"Deschutes County Health Services","HIV Alliance",null,null,null,"Mid-Columbia Center for Living","ColumbiaCare Services",null,"Grace Roots","The Stronghold","The Stronghold",null,"Ideal Option","HIV Alliance",null,"Community Services Consortium","Coastal Phoenix Rising","CHANCE","Origins Faith Community Outreach Initiative (OFCOI)","Ideal Option",null,"CODA, Inc.","Fresh-Out Community Based Re-Entry Program","Juntos LLC","Lutheran Community Services",null,null,"Rinehart Clinic and Pharmacy","Cow Creek","Eastern Oregon Center for Independent Living",null,null,"Eastern Oregon Center for Independent Living","Forest Grove Foundation",null,null,"Providence Newberg Medical Center"]
[null,"Example","Example",null,"BentonBenton County Health Department","Benton","03","Benton","02",176757,"Benton County Health Department",null,"008",null,null,null,null,null,null,null,null,null,null,null,null,null,176757,"176757-0","2022-07-28",null,null,"2022-07-25","2022-07-20","2022-07-25","Yes","Yes","Complete",0,null,null,null,null,null,null,null,null,null,null,"2022-08-19",313445.28000000003,313445.28000000003,0,125378.16,31344.52,6,313445.28000000003,0,"Yes","No",125378.16,0,183719.25,4766,93485,2980,28495.03,313445.28000000003,0,"Services and Supplies total omitting $1,200 cost for Tablets",0.58612862187620107,1.5205205833694479E-2,0.29824982529645999,9.5072415829646553E-3,9.0909105410679647E-2,null,null,null,null,"Family Recovery, Inc.","LifeStance","Helping Hands Re-Entry and Outreach","Medicine Wheel Recovery","Medicine Wheel Recovery","HIV Alliance",null,null,"Healing Reins Therapeutic Riding Center",null,null,null,null,"One Community Health","Community Works",null,"Grants Pass Sobering Center","Klamath Basin Behavioral Health","Klamath Basin Behavioral Health",null,"OSLC Developments, Inc.","Housing Our Veterans",null,"Confederated Tribes of the Siletz","Lincoln County HHS Harm Reduction Program","Community Services Consortium",null,"Iron Tribe Network",null,"Iron Tribe Network","Going Home II","New Avenues for Youth","New Avenues for Youth",null,null,"Tillamook County Community Health","CT Coos, Lower Umpqua, and Siuslaw",null,null,null,"Give them WINGS","HIV Alliance",null,null,"Provoking Hope"]
[null,"Baker","Baker",null,"BentonCHANCE","Benton","03","Benton","02",176761,"CHANCE","CHANCE LLC","022",true,"2022-11-15","Valid",null,null,null,null,null,"2023-07-01","2023-07-01","2023-07-01","Yes",null,176761,"176761-0","2022-06-29",null,null,"2022-07-25","2022-07-21","2022-07-25","Yes","Yes","Complete",0,null,null,null,null,null,null,null,null,null,null,"2022-08-20",1058507.45,1058507.45,0,423403.01,105850.74,6,1058507.45,0,"Yes","No",423403.01,0,205200,3839,718784.33,61000,66960,1055783.33,2724.1199999998798,null,0.19435806019024754,3.6361627342610153E-3,0.68080666702703097,5.7777006196905949E-2,6.3422103851554459E-2,null,null,null,null,"Family Tree Relief Nursery","MetroPlus Association","Iron Tribe Network","Youth ERA","Youth ERA","Youth ERA",null,null,"Ideal Option",null,null,null,null,"Providence Hood River","Compass House",null,"HIV Alliance","Lutheran Community Services","Lutheran Community Services",null,"South Lane Mental Health Services, Inc.","Laurel Hill Center",null,"Lincoln County HHS Harm Reduction Program",null,"Faith, Hope and Charity, Inc. (FHC)",null,"Marion County",null,"Morrison Child and Family Services","Just Men In Recovery","Northwest Family Services","OHSU, Addiction and Complex Pain",null,null,"Tillamook Family Counseling","Grand Ronde",null,null,null,"Greater Oregon Behavioral Health","Ideal Option",null,null,"Virginia Garcia Clinic"]
[null,"Benton","Benton",null,"BentonCorvallis Housing First","Benton","03","Benton","02",176769,"Corvallis Housing First","Corvallis Housing First","038",true,"2023-09-30","Valid",null,null,null,null,null,null,null,null,null,null,176769,"176769-0","2022-07-04",null,null,"2022-07-25","2022-07-21","2022-07-25","Yes","Yes","Complete",0,null,null,null,null,null,null,null,null,null,null,"2022-08-20",265923.78000000003,262923.78000000003,3000,43820.63,43820.63,5,262923.78000000003,0,"Yes","No",0,null,61541,144600,37232.78,25000,0,268373.78000000003,-5450,null,0.22931077693208329,0.53880077256429437,0.13873478996346064,9.3153660540161554E-2,0,null,null,null,null,"Pathfinder Club of Oregon","Morrison Child and Family Services","Morrison Child and Family Services",null,null,"BestCare Treatment Services, Inc.",null,null,"Rimrock Trails Treatment Services",null,null,null,null,null,"Family Nurturing Center",null,"Max's Mission","Transformations","Transformations",null,"Youth ERA","Looking Glass Community Services",null,"Samaritan Treatment & Recovery",null,"Family Tree Relief Nursery",null,"Pathfinder Club of Oregon",null,"New Avenues for Youth","Addiction Counselor Certification Board of Oregon (MHACBO)","Northwest Instituto Latino De Adicciones","OHSU, Partnership Project",null,null,"Tillamook Serenity Club","Klamath Tribes",null,null,null,"Mid-Columbia Center for Living","LifeWorks NW",null,null,"Yamhill Community Action Partnership"]
[null,"Clackamas","Clackamas",null,"BentonFamily Recovery, Inc.","Benton","03","Benton","02",176756,"Family Recovery, Inc.","Family Recovery, Inc.","046",true,"2022-10-06","Valid",null,null,null,null,null,null,null,null,null,null,176756,"176756-0","2022-06-29",null,null,"2022-07-25","2022-07-22","2022-07-25","Yes","Yes","Complete",0,null,null,null,null,null,null,null,null,null,null,"2022-08-21",912642,912642,0,365056.8,91264.2,6,912642,0,"Yes","No",365056.8,0,557472,10800,323570,20800,0,912642,0,null,0.61083316349674899,1.1833774908452603E-2,0.35454208769703782,2.2790973897760566E-2,0,null,null,null,null,null,"New Avenues for Youth","Providence Seaside Hosp. Foundation",null,null,"Rimrock Trails Treatment Services",null,null,"Volunteers of America - Oregon",null,null,null,null,null,"HIV Alliance",null,"OnTrack, Inc.",null,null,null,null,"Restored Connections Peer Center",null,null,null,"Samaritan Health Services",null,null,null,"Northwest Family Services","MetroPlus Association","SE Works Inc","Portland Street Medicine",null,null,"Project Quest","NARA",null,null,null,"Mid-Columbia Medical Center","Lutheran Community Services",null,null,"Yamhill County HHS"]
[null,"Clatsop","Clatsop",null,"BentonFamily Tree Relief Nursery","Benton","03","Benton","02",176759,"Family Tree Relief Nursery","Family Tree Relief Nursery","047",true,"2023-02-27","Valid",null,null,null,null,null,null,null,null,null,null,176759,"176759-0","2022-06-28",null,null,"2022-07-25","2022-07-22","2022-07-25","Yes","Yes","Complete",0,null,null,null,null,null,null,null,null,null,null,"2022-08-21",717510,717510,0,119585,119585,5,717510,0,"Yes","No",119585,0,498926,31500,171084,16000,0,717510,0,null,0.69535755599225102,4.3901827152234812E-2,0.23844127607977589,2.2299340775738318E-2,0,null,null,null,null,null,"Northwest Family Services",null,null,null,null,null,null,null,null,null,null,null,null,"Jackson County Health & Human Services",null,"Options for Southern Oregon",null,null,null,null,"Shelter Care",null,null,null,null,null,null,null,"Pathfinders of Oregon","Oregon Change Clinic","The 4th Dimension Recovery Center","Providence Portland Medical Foundation",null,null,null,"NPAIHB",null,null,null,"North Central Public Health District","MetroPlus Association",null,null,"Yamhill Community Action Partnership"]
{"$rows_left_out":262}
{"sheet":"Certification","index":4,"n_rows":15,"n_cols":3,"rows_kept":15,"cut":false,"hidden":false,"merged":[[6,2,6,3],[9,2,9,3],[13,2,13,3]]}
[]
[null,"Certification"]
[]
[null,null,"I attest that these are only M110 funds (check box)"]
[]
[]
[null,null,"Phil"]
[null,null,"PREPARED BY"]
[]
[]
{"$rows_left_out":6}
{"sheet":"Data Entry Import","index":5,"n_rows":26,"n_cols":19,"rows_kept":26,"cut":false,"hidden":true,"merged":[[2,16,2,18],[17,0,17,1],[2,1,2,5],[2,6,2,10],[2,11,2,15]]}
[]
[]
[null,"Informational Data",null,null,null,null,"M110 Budget by Budget Category (%)",null,null,null,null,"M110 Budget by Budget Category",null,null,null,null,"Certification Information"]
["Expense Category","BHRN Name","BHRN Partner Name","Grant Agreement Number","Contract Not-to-Exceed Amount","Does Original Budget Require Revision?","Personnel Costs (%)","Program Staff Training Costs (%)","Services and Supplies Costs (%)","Capital Outlay Costs (%)","Admin Costs (%)","Personnel Costs  ($)","Program Staff Training Costs ($)","Services and Supplies Costs ($)","Capital Outlay Costs ($)","Admin Costs ($)","Prepared by:","Authorized Agent Signature:","Date"]
["Data",{"$f":"'Budget Report'!D6","v":"Yamhill_County"},{"$f":"'Budget Report'!D7","v":0},{"$f":"'Budget Report'!D8","v":""},{"$f":"'Budget Report'!D9","v":0},{"$f":"'Budget Report'!D11","v":0},{"$f":"'Budget Report'!E28","v":0},{"$f":"'Budget Report'!E29","v":0},{"$f":"'Budget Report'!E30","v":0},{"$f":"'Budget Report'!E31","v":0},{"$f":"'Budget Report'!E32","v":0},{"$f":"'Budget Report'!F28","v":0},{"$f":"'Budget Report'!F29","v":0},{"$f":"'Budget Report'!F30","v":0},{"$f":"'Budget Report'!F31","v":0},{"$f":"'Budget Report'!F32","v":"num"},{"$f":"Certification!C7","v":"Phil"},{"$f":"Certification!C10","v":0},{"$f":"Certification!C14","v":"00:00:00"}]
[]
["Errors","Result"]
["Is the Report Dated After 12/1/2022?"]
[" Is report signed (Y/N)?"]
["Is the box checked to attest that only M110 funds are used?"]
{"$rows_left_out":16}